[CALCITE-6241] Enable a few existing functions to hive library #13913
main.yml
on: pull_request
Windows (JDK 8)
6m 0s
Windows (JDK 17)
4m 38s
Windows (JDK 21)
4m 50s
Linux (JDK 8, oldest Guava, America/New_York Timezone)
2m 31s
Linux (JDK 8, latest Guava, America/New_York Timezone)
2m 36s
Linux (JDK 11, Pacific/Chatham Timezone)
4m 34s
Linux (JDK 17)
2m 24s
Linux (JDK 21)
4m 34s
Linux (JDK 23)
4m 33s
Linux (JDK 11, Avatica main)
7m 48s
macOS (JDK 21)
8m 7s
ErrorProne (JDK 11, latest Guava)
2m 34s
CheckerFramework (JDK 11)
5m 19s
CheckerFramework (JDK 11, oldest Guava)
5m 23s
Linux (JDK 8) Slow Tests
0s
Druid Tests
5m 48s
Annotations
150 errors and 30 warnings
Linux (JDK 17):
task ':core:compileJava'#L1
Execution failed for task ':core:compileJava':
org.gradle.api.internal.tasks.compile.CompilationFailedException: Compilation failed; see the compiler error output for details.
at org.gradle.api.internal.tasks.compile.JdkJavaCompiler.execute(JdkJavaCompiler.java:61)
at org.gradle.api.internal.tasks.compile.JdkJavaCompiler.execute(JdkJavaCompiler.java:41)
at org.gradle.api.internal.tasks.compile.NormalizingJavaCompiler.delegateAndHandleErrors(NormalizingJavaCompiler.java:98)
at org.gradle.api.internal.tasks.compile.NormalizingJavaCompiler.execute(NormalizingJavaCompiler.java:52)
at org.gradle.api.internal.tasks.compile.NormalizingJavaCompiler.execute(NormalizingJavaCompiler.java:38)
at org.gradle.api.internal.tasks.compile.AnnotationProcessorDiscoveringCompiler.execute(AnnotationProcessorDiscoveringCompiler.java:52)
at org.gradle.api.internal.tasks.compile.AnnotationProcessorDiscoveringCompiler.execute(AnnotationProcessorDiscoveringCompiler.java:38)
at org.gradle.api.internal.tasks.compile.ModuleApplicationNameWritingCompiler.execute(ModuleApplicationNameWritingCompiler.java:46)
at org.gradle.api.internal.tasks.compile.ModuleApplicationNameWritingCompiler.execute(ModuleApplicationNameWritingCompiler.java:36)
at org.gradle.jvm.toolchain.internal.DefaultToolchainJavaCompiler.execute(DefaultToolchainJavaCompiler.java:57)
at org.gradle.api.tasks.compile.JavaCompile.lambda$createToolchainCompiler$3(JavaCompile.java:202)
at org.gradle.api.internal.tasks.compile.CleaningJavaCompiler.execute(CleaningJavaCompiler.java:53)
at org.gradle.api.internal.tasks.compile.incremental.IncrementalCompilerFactory.lambda$createRebuildAllCompiler$0(IncrementalCompilerFactory.java:52)
at org.gradle.api.internal.tasks.compile.incremental.SelectiveCompiler.execute(SelectiveCompiler.java:70)
at org.gradle.api.internal.tasks.compile.incremental.SelectiveCompiler.execute(SelectiveCompiler.java:44)
at org.gradle.api.internal.tasks.compile.incremental.IncrementalResultStoringCompiler.execute(IncrementalResultStoringCompiler.java:66)
at org.gradle.api.internal.tasks.compile.incremental.IncrementalResultStoringCompiler.execute(IncrementalResultStoringCompiler.java:52)
at org.gradle.api.internal.tasks.compile.CompileJavaBuildOperationReportingCompiler$1.call(CompileJavaBuildOperationReportingCompiler.java:64)
at org.gradle.api.internal.tasks.compile.CompileJavaBuildOperationReportingCompiler$1.call(CompileJavaBuildOperationReportingCompiler.java:48)
at org.gradle.internal.operations.DefaultBuildOperationRunner$CallableBuildOperationWorker.execute(DefaultBuildOperationRunner.java:200)
at org.gradle.internal.operations.DefaultBuildOperationRunner$CallableBuildOperationWorker.execute(DefaultBuildOperationRunner.java:195)
at org.gradle.internal.operations.DefaultBuildOperationRunner$2.execute(DefaultBuildOperationRunner.java:66)
at org.gradle.internal.operations.DefaultBuildOperationRunner$2.execute(DefaultBuildOperationRunner.java:59)
at org.gradle.internal.operations.DefaultBuildOperationRunner.execute(DefaultBuildOperationRunner.java:157)
at org.gradle.internal.operations.DefaultBuildOperationRunner.execute(DefaultBuildOperationRunner.java:59)
at org.gradle.internal.operations.DefaultBuildOperationRunner.call(DefaultBuildOperationRunner.java:53)
at org.gradle.internal.operations.DefaultBuildOperationExecutor.call(DefaultBuildOperationExecutor.java:73)
at org.gradle.api.internal.tasks.compile.CompileJavaBuildOperationReportingCompiler.execute(CompileJavaBuildOperationReportingCompiler.java:48)
at org.gradle.api.tasks.compile.JavaCompile.performCompilation(JavaCompile.java:220)
at org.gradle.api.tasks.compile.JavaCompile.performIncrementalCompilation(JavaCompile.java:161)
at org.gradle.api.tasks.compile.JavaCompile.compile(JavaCompile.java:146)
at org.gradle.internal.reflect.JavaMethod.invoke(JavaMethod.j
|
Linux (JDK 17)
Execution failed for task ':core:compileJava'.
> Compilation failed; see the compiler error output for details.
|
Linux (JDK 17):
core/src/main/java/org/apache/calcite/rel/stream/StreamRules.java#L343
[Task :core:compileJava] cannot find symbol
ImmutableDeltaTableScanToEmptyRuleConfig DEFAULT =
^
symbol: class ImmutableDeltaTableScanToEmptyRuleConfig
|
Linux (JDK 17):
core/src/main/java/org/apache/calcite/rel/rules/JoinDeriveIsNotNullFilterRule.java#L107
[Task :core:compileJava] package ImmutableJoinDeriveIsNotNullFilterRule does not exist
ImmutableJoinDeriveIsNotNullFilterRule.Config DEFAULT =
^
|
Linux (JDK 17):
core/src/main/java/org/apache/calcite/sql/fun/SqlLibraryOperators.java#L138
[Task :core:compileJava] LibraryOperator is not a repeatable annotation type
@LibraryOperator(libraries = {SPARK})
^
|
Linux (JDK 17):
core/src/main/java/org/apache/calcite/sql/validate/SqlValidator.java#L836
[Task :core:compileJava] package ImmutableSqlValidator does not exist
SqlValidator.Config DEFAULT = ImmutableSqlValidator.Config.builder()
^
|
Linux (JDK 17):
core/src/main/java/org/apache/calcite/sql/parser/SqlParser.java#L268
[Task :core:compileJava] package ImmutableSqlParser does not exist
Config DEFAULT = ImmutableSqlParser.Config.of();
^
|
Linux (JDK 17):
core/src/main/java/org/apache/calcite/sql2rel/SqlToRelConverter.java#L257
[Task :core:compileJava] package ImmutableSqlToRelConverter does not exist
ImmutableSqlToRelConverter.Config.builder()
^
|
Linux (JDK 17):
core/src/main/java/org/apache/calcite/rel/rules/AggregateRemoveRule.java#L169
[Task :core:compileJava] package ImmutableAggregateRemoveRule does not exist
Config DEFAULT = ImmutableAggregateRemoveRule.Config.of()
^
|
Linux (JDK 17):
core/src/main/java/org/apache/calcite/tools/RelBuilder.java#L5050
[Task :core:compileJava] package ImmutableRelBuilder does not exist
Config DEFAULT = ImmutableRelBuilder.Config.of();
^
|
Linux (JDK 8, oldest Guava, America/New_York Timezone):
task ':core:compileJava'#L1
Execution failed for task ':core:compileJava':
org.gradle.api.internal.tasks.compile.CompilationFailedException: Compilation failed; see the compiler error output for details.
at org.gradle.api.internal.tasks.compile.JdkJavaCompiler.execute(JdkJavaCompiler.java:61)
at org.gradle.api.internal.tasks.compile.JdkJavaCompiler.execute(JdkJavaCompiler.java:41)
at org.gradle.api.internal.tasks.compile.NormalizingJavaCompiler.delegateAndHandleErrors(NormalizingJavaCompiler.java:98)
at org.gradle.api.internal.tasks.compile.NormalizingJavaCompiler.execute(NormalizingJavaCompiler.java:52)
at org.gradle.api.internal.tasks.compile.NormalizingJavaCompiler.execute(NormalizingJavaCompiler.java:38)
at org.gradle.api.internal.tasks.compile.AnnotationProcessorDiscoveringCompiler.execute(AnnotationProcessorDiscoveringCompiler.java:52)
at org.gradle.api.internal.tasks.compile.AnnotationProcessorDiscoveringCompiler.execute(AnnotationProcessorDiscoveringCompiler.java:38)
at org.gradle.api.internal.tasks.compile.ModuleApplicationNameWritingCompiler.execute(ModuleApplicationNameWritingCompiler.java:46)
at org.gradle.api.internal.tasks.compile.ModuleApplicationNameWritingCompiler.execute(ModuleApplicationNameWritingCompiler.java:36)
at org.gradle.jvm.toolchain.internal.DefaultToolchainJavaCompiler.execute(DefaultToolchainJavaCompiler.java:57)
at org.gradle.api.tasks.compile.JavaCompile.lambda$createToolchainCompiler$3(JavaCompile.java:202)
at org.gradle.api.internal.tasks.compile.CleaningJavaCompiler.execute(CleaningJavaCompiler.java:53)
at org.gradle.api.internal.tasks.compile.incremental.IncrementalCompilerFactory.lambda$createRebuildAllCompiler$0(IncrementalCompilerFactory.java:52)
at org.gradle.api.internal.tasks.compile.incremental.SelectiveCompiler.execute(SelectiveCompiler.java:70)
at org.gradle.api.internal.tasks.compile.incremental.SelectiveCompiler.execute(SelectiveCompiler.java:44)
at org.gradle.api.internal.tasks.compile.incremental.IncrementalResultStoringCompiler.execute(IncrementalResultStoringCompiler.java:66)
at org.gradle.api.internal.tasks.compile.incremental.IncrementalResultStoringCompiler.execute(IncrementalResultStoringCompiler.java:52)
at org.gradle.api.internal.tasks.compile.CompileJavaBuildOperationReportingCompiler$1.call(CompileJavaBuildOperationReportingCompiler.java:64)
at org.gradle.api.internal.tasks.compile.CompileJavaBuildOperationReportingCompiler$1.call(CompileJavaBuildOperationReportingCompiler.java:48)
at org.gradle.internal.operations.DefaultBuildOperationRunner$CallableBuildOperationWorker.execute(DefaultBuildOperationRunner.java:200)
at org.gradle.internal.operations.DefaultBuildOperationRunner$CallableBuildOperationWorker.execute(DefaultBuildOperationRunner.java:195)
at org.gradle.internal.operations.DefaultBuildOperationRunner$2.execute(DefaultBuildOperationRunner.java:66)
at org.gradle.internal.operations.DefaultBuildOperationRunner$2.execute(DefaultBuildOperationRunner.java:59)
at org.gradle.internal.operations.DefaultBuildOperationRunner.execute(DefaultBuildOperationRunner.java:157)
at org.gradle.internal.operations.DefaultBuildOperationRunner.execute(DefaultBuildOperationRunner.java:59)
at org.gradle.internal.operations.DefaultBuildOperationRunner.call(DefaultBuildOperationRunner.java:53)
at org.gradle.internal.operations.DefaultBuildOperationExecutor.call(DefaultBuildOperationExecutor.java:73)
at org.gradle.api.internal.tasks.compile.CompileJavaBuildOperationReportingCompiler.execute(CompileJavaBuildOperationReportingCompiler.java:48)
at org.gradle.api.tasks.compile.JavaCompile.performCompilation(JavaCompile.java:220)
at org.gradle.api.tasks.compile.JavaCompile.performIncrementalCompilation(JavaCompile.java:161)
at org.gradle.api.tasks.compile.JavaCompile.compile(JavaCompile.java:146)
at org.gradle.internal.reflect.JavaMethod.invoke(JavaMethod.j
|
Linux (JDK 8, oldest Guava, America/New_York Timezone)
Execution failed for task ':core:compileJava'.
> Compilation failed; see the compiler error output for details.
|
Linux (JDK 8, oldest Guava, America/New_York Timezone):
core/src/main/java/org/apache/calcite/rel/stream/StreamRules.java#L343
[Task :core:compileJava] cannot find symbol
ImmutableDeltaTableScanToEmptyRuleConfig DEFAULT =
^
symbol: class ImmutableDeltaTableScanToEmptyRuleConfig
|
Linux (JDK 8, oldest Guava, America/New_York Timezone):
core/src/main/java/org/apache/calcite/rel/rules/JoinDeriveIsNotNullFilterRule.java#L107
[Task :core:compileJava] package ImmutableJoinDeriveIsNotNullFilterRule does not exist
ImmutableJoinDeriveIsNotNullFilterRule.Config DEFAULT =
^
|
Linux (JDK 8, oldest Guava, America/New_York Timezone):
core/src/main/java/org/apache/calcite/sql/fun/SqlLibraryOperators.java#L138
[Task :core:compileJava] org.apache.calcite.sql.fun.LibraryOperator is not a repeatable annotation type
@LibraryOperator(libraries = {SPARK})
^
|
Linux (JDK 8, oldest Guava, America/New_York Timezone):
core/src/main/java/org/apache/calcite/sql/validate/SqlValidator.java#L836
[Task :core:compileJava] package ImmutableSqlValidator does not exist
SqlValidator.Config DEFAULT = ImmutableSqlValidator.Config.builder()
^
|
Linux (JDK 8, oldest Guava, America/New_York Timezone):
core/src/main/java/org/apache/calcite/sql/SqlWriterConfig.java#L432
[Task :core:compileJava] cannot find symbol
return ImmutableSqlWriterConfig.of();
^
symbol: variable ImmutableSqlWriterConfig
|
Linux (JDK 8, oldest Guava, America/New_York Timezone):
core/src/main/java/org/apache/calcite/sql2rel/SqlToRelConverter.java#L257
[Task :core:compileJava] package ImmutableSqlToRelConverter does not exist
ImmutableSqlToRelConverter.Config.builder()
^
|
Linux (JDK 8, oldest Guava, America/New_York Timezone):
core/src/main/java/org/apache/calcite/sql/parser/SqlParser.java#L268
[Task :core:compileJava] package ImmutableSqlParser does not exist
Config DEFAULT = ImmutableSqlParser.Config.of();
^
|
Linux (JDK 8, oldest Guava, America/New_York Timezone):
core/src/main/java/org/apache/calcite/rel/rules/AggregateRemoveRule.java#L169
[Task :core:compileJava] package ImmutableAggregateRemoveRule does not exist
Config DEFAULT = ImmutableAggregateRemoveRule.Config.of()
^
|
ErrorProne (JDK 11, latest Guava):
task ':core:compileJava'#L1
Execution failed for task ':core:compileJava':
org.gradle.api.internal.tasks.compile.CompilationFailedException: Compilation failed; see the compiler error output for details.
at org.gradle.api.internal.tasks.compile.JdkJavaCompiler.execute(JdkJavaCompiler.java:61)
at org.gradle.api.internal.tasks.compile.JdkJavaCompiler.execute(JdkJavaCompiler.java:41)
at org.gradle.api.internal.tasks.compile.NormalizingJavaCompiler.delegateAndHandleErrors(NormalizingJavaCompiler.java:98)
at org.gradle.api.internal.tasks.compile.NormalizingJavaCompiler.execute(NormalizingJavaCompiler.java:52)
at org.gradle.api.internal.tasks.compile.NormalizingJavaCompiler.execute(NormalizingJavaCompiler.java:38)
at org.gradle.api.internal.tasks.compile.AnnotationProcessorDiscoveringCompiler.execute(AnnotationProcessorDiscoveringCompiler.java:52)
at org.gradle.api.internal.tasks.compile.AnnotationProcessorDiscoveringCompiler.execute(AnnotationProcessorDiscoveringCompiler.java:38)
at org.gradle.api.internal.tasks.compile.ModuleApplicationNameWritingCompiler.execute(ModuleApplicationNameWritingCompiler.java:46)
at org.gradle.api.internal.tasks.compile.ModuleApplicationNameWritingCompiler.execute(ModuleApplicationNameWritingCompiler.java:36)
at org.gradle.jvm.toolchain.internal.DefaultToolchainJavaCompiler.execute(DefaultToolchainJavaCompiler.java:57)
at org.gradle.api.tasks.compile.JavaCompile.lambda$createToolchainCompiler$3(JavaCompile.java:202)
at org.gradle.api.internal.tasks.compile.CleaningJavaCompiler.execute(CleaningJavaCompiler.java:53)
at org.gradle.api.internal.tasks.compile.incremental.IncrementalCompilerFactory.lambda$createRebuildAllCompiler$0(IncrementalCompilerFactory.java:52)
at org.gradle.api.internal.tasks.compile.incremental.SelectiveCompiler.execute(SelectiveCompiler.java:70)
at org.gradle.api.internal.tasks.compile.incremental.SelectiveCompiler.execute(SelectiveCompiler.java:44)
at org.gradle.api.internal.tasks.compile.incremental.IncrementalResultStoringCompiler.execute(IncrementalResultStoringCompiler.java:66)
at org.gradle.api.internal.tasks.compile.incremental.IncrementalResultStoringCompiler.execute(IncrementalResultStoringCompiler.java:52)
at org.gradle.api.internal.tasks.compile.CompileJavaBuildOperationReportingCompiler$1.call(CompileJavaBuildOperationReportingCompiler.java:64)
at org.gradle.api.internal.tasks.compile.CompileJavaBuildOperationReportingCompiler$1.call(CompileJavaBuildOperationReportingCompiler.java:48)
at org.gradle.internal.operations.DefaultBuildOperationRunner$CallableBuildOperationWorker.execute(DefaultBuildOperationRunner.java:200)
at org.gradle.internal.operations.DefaultBuildOperationRunner$CallableBuildOperationWorker.execute(DefaultBuildOperationRunner.java:195)
at org.gradle.internal.operations.DefaultBuildOperationRunner$2.execute(DefaultBuildOperationRunner.java:66)
at org.gradle.internal.operations.DefaultBuildOperationRunner$2.execute(DefaultBuildOperationRunner.java:59)
at org.gradle.internal.operations.DefaultBuildOperationRunner.execute(DefaultBuildOperationRunner.java:157)
at org.gradle.internal.operations.DefaultBuildOperationRunner.execute(DefaultBuildOperationRunner.java:59)
at org.gradle.internal.operations.DefaultBuildOperationRunner.call(DefaultBuildOperationRunner.java:53)
at org.gradle.internal.operations.DefaultBuildOperationExecutor.call(DefaultBuildOperationExecutor.java:73)
at org.gradle.api.internal.tasks.compile.CompileJavaBuildOperationReportingCompiler.execute(CompileJavaBuildOperationReportingCompiler.java:48)
at org.gradle.api.tasks.compile.JavaCompile.performCompilation(JavaCompile.java:220)
at org.gradle.api.tasks.compile.JavaCompile.performIncrementalCompilation(JavaCompile.java:161)
at org.gradle.api.tasks.compile.JavaCompile.compile(JavaCompile.java:146)
at org.gradle.internal.reflect.JavaMethod.invoke(JavaMethod.j
|
ErrorProne (JDK 11, latest Guava)
Execution failed for task ':core:compileJava'.
> Compilation failed; see the compiler error output for details.
|
ErrorProne (JDK 11, latest Guava):
core/src/main/java/org/apache/calcite/rel/stream/StreamRules.java#L343
[Task :core:compileJava] cannot find symbol
ImmutableDeltaTableScanToEmptyRuleConfig DEFAULT =
^
symbol: class ImmutableDeltaTableScanToEmptyRuleConfig
|
ErrorProne (JDK 11, latest Guava):
core/src/main/java/org/apache/calcite/rel/rules/JoinDeriveIsNotNullFilterRule.java#L107
[Task :core:compileJava] package ImmutableJoinDeriveIsNotNullFilterRule does not exist
ImmutableJoinDeriveIsNotNullFilterRule.Config DEFAULT =
^
|
ErrorProne (JDK 11, latest Guava):
core/src/main/java/org/apache/calcite/sql/fun/SqlLibraryOperators.java#L138
[Task :core:compileJava] LibraryOperator is not a repeatable annotation type
@LibraryOperator(libraries = {SPARK})
^
|
ErrorProne (JDK 11, latest Guava):
core/src/main/java/org/apache/calcite/sql/validate/SqlValidator.java#L836
[Task :core:compileJava] package ImmutableSqlValidator does not exist
SqlValidator.Config DEFAULT = ImmutableSqlValidator.Config.builder()
^
|
ErrorProne (JDK 11, latest Guava):
core/src/main/java/org/apache/calcite/sql/parser/SqlParser.java#L268
[Task :core:compileJava] package ImmutableSqlParser does not exist
Config DEFAULT = ImmutableSqlParser.Config.of();
^
|
ErrorProne (JDK 11, latest Guava):
core/src/main/java/org/apache/calcite/sql2rel/SqlToRelConverter.java#L257
[Task :core:compileJava] package ImmutableSqlToRelConverter does not exist
ImmutableSqlToRelConverter.Config.builder()
^
|
ErrorProne (JDK 11, latest Guava):
core/src/main/java/org/apache/calcite/rel/rules/AggregateRemoveRule.java#L169
[Task :core:compileJava] package ImmutableAggregateRemoveRule does not exist
Config DEFAULT = ImmutableAggregateRemoveRule.Config.of()
^
|
ErrorProne (JDK 11, latest Guava):
core/src/main/java/org/apache/calcite/tools/RelBuilder.java#L5050
[Task :core:compileJava] package ImmutableRelBuilder does not exist
Config DEFAULT = ImmutableRelBuilder.Config.of();
^
|
Linux (JDK 8, latest Guava, America/New_York Timezone):
task ':core:compileJava'#L1
Execution failed for task ':core:compileJava':
org.gradle.api.internal.tasks.compile.CompilationFailedException: Compilation failed; see the compiler error output for details.
at org.gradle.api.internal.tasks.compile.JdkJavaCompiler.execute(JdkJavaCompiler.java:61)
at org.gradle.api.internal.tasks.compile.JdkJavaCompiler.execute(JdkJavaCompiler.java:41)
at org.gradle.api.internal.tasks.compile.NormalizingJavaCompiler.delegateAndHandleErrors(NormalizingJavaCompiler.java:98)
at org.gradle.api.internal.tasks.compile.NormalizingJavaCompiler.execute(NormalizingJavaCompiler.java:52)
at org.gradle.api.internal.tasks.compile.NormalizingJavaCompiler.execute(NormalizingJavaCompiler.java:38)
at org.gradle.api.internal.tasks.compile.AnnotationProcessorDiscoveringCompiler.execute(AnnotationProcessorDiscoveringCompiler.java:52)
at org.gradle.api.internal.tasks.compile.AnnotationProcessorDiscoveringCompiler.execute(AnnotationProcessorDiscoveringCompiler.java:38)
at org.gradle.api.internal.tasks.compile.ModuleApplicationNameWritingCompiler.execute(ModuleApplicationNameWritingCompiler.java:46)
at org.gradle.api.internal.tasks.compile.ModuleApplicationNameWritingCompiler.execute(ModuleApplicationNameWritingCompiler.java:36)
at org.gradle.jvm.toolchain.internal.DefaultToolchainJavaCompiler.execute(DefaultToolchainJavaCompiler.java:57)
at org.gradle.api.tasks.compile.JavaCompile.lambda$createToolchainCompiler$3(JavaCompile.java:202)
at org.gradle.api.internal.tasks.compile.CleaningJavaCompiler.execute(CleaningJavaCompiler.java:53)
at org.gradle.api.internal.tasks.compile.incremental.IncrementalCompilerFactory.lambda$createRebuildAllCompiler$0(IncrementalCompilerFactory.java:52)
at org.gradle.api.internal.tasks.compile.incremental.SelectiveCompiler.execute(SelectiveCompiler.java:70)
at org.gradle.api.internal.tasks.compile.incremental.SelectiveCompiler.execute(SelectiveCompiler.java:44)
at org.gradle.api.internal.tasks.compile.incremental.IncrementalResultStoringCompiler.execute(IncrementalResultStoringCompiler.java:66)
at org.gradle.api.internal.tasks.compile.incremental.IncrementalResultStoringCompiler.execute(IncrementalResultStoringCompiler.java:52)
at org.gradle.api.internal.tasks.compile.CompileJavaBuildOperationReportingCompiler$1.call(CompileJavaBuildOperationReportingCompiler.java:64)
at org.gradle.api.internal.tasks.compile.CompileJavaBuildOperationReportingCompiler$1.call(CompileJavaBuildOperationReportingCompiler.java:48)
at org.gradle.internal.operations.DefaultBuildOperationRunner$CallableBuildOperationWorker.execute(DefaultBuildOperationRunner.java:200)
at org.gradle.internal.operations.DefaultBuildOperationRunner$CallableBuildOperationWorker.execute(DefaultBuildOperationRunner.java:195)
at org.gradle.internal.operations.DefaultBuildOperationRunner$2.execute(DefaultBuildOperationRunner.java:66)
at org.gradle.internal.operations.DefaultBuildOperationRunner$2.execute(DefaultBuildOperationRunner.java:59)
at org.gradle.internal.operations.DefaultBuildOperationRunner.execute(DefaultBuildOperationRunner.java:157)
at org.gradle.internal.operations.DefaultBuildOperationRunner.execute(DefaultBuildOperationRunner.java:59)
at org.gradle.internal.operations.DefaultBuildOperationRunner.call(DefaultBuildOperationRunner.java:53)
at org.gradle.internal.operations.DefaultBuildOperationExecutor.call(DefaultBuildOperationExecutor.java:73)
at org.gradle.api.internal.tasks.compile.CompileJavaBuildOperationReportingCompiler.execute(CompileJavaBuildOperationReportingCompiler.java:48)
at org.gradle.api.tasks.compile.JavaCompile.performCompilation(JavaCompile.java:220)
at org.gradle.api.tasks.compile.JavaCompile.performIncrementalCompilation(JavaCompile.java:161)
at org.gradle.api.tasks.compile.JavaCompile.compile(JavaCompile.java:146)
at org.gradle.internal.reflect.JavaMethod.invoke(JavaMethod.j
|
Linux (JDK 8, latest Guava, America/New_York Timezone)
Execution failed for task ':core:compileJava'.
> Compilation failed; see the compiler error output for details.
|
Linux (JDK 8, latest Guava, America/New_York Timezone):
core/src/main/java/org/apache/calcite/rel/stream/StreamRules.java#L343
[Task :core:compileJava] cannot find symbol
ImmutableDeltaTableScanToEmptyRuleConfig DEFAULT =
^
symbol: class ImmutableDeltaTableScanToEmptyRuleConfig
|
Linux (JDK 8, latest Guava, America/New_York Timezone):
core/src/main/java/org/apache/calcite/rel/rules/JoinDeriveIsNotNullFilterRule.java#L107
[Task :core:compileJava] package ImmutableJoinDeriveIsNotNullFilterRule does not exist
ImmutableJoinDeriveIsNotNullFilterRule.Config DEFAULT =
^
|
Linux (JDK 8, latest Guava, America/New_York Timezone):
core/src/main/java/org/apache/calcite/sql/fun/SqlLibraryOperators.java#L138
[Task :core:compileJava] org.apache.calcite.sql.fun.LibraryOperator is not a repeatable annotation type
@LibraryOperator(libraries = {SPARK})
^
|
Linux (JDK 8, latest Guava, America/New_York Timezone):
core/src/main/java/org/apache/calcite/sql/validate/SqlValidator.java#L836
[Task :core:compileJava] package ImmutableSqlValidator does not exist
SqlValidator.Config DEFAULT = ImmutableSqlValidator.Config.builder()
^
|
Linux (JDK 8, latest Guava, America/New_York Timezone):
core/src/main/java/org/apache/calcite/sql/SqlWriterConfig.java#L432
[Task :core:compileJava] cannot find symbol
return ImmutableSqlWriterConfig.of();
^
symbol: variable ImmutableSqlWriterConfig
|
Linux (JDK 8, latest Guava, America/New_York Timezone):
core/src/main/java/org/apache/calcite/sql2rel/SqlToRelConverter.java#L257
[Task :core:compileJava] package ImmutableSqlToRelConverter does not exist
ImmutableSqlToRelConverter.Config.builder()
^
|
Linux (JDK 8, latest Guava, America/New_York Timezone):
core/src/main/java/org/apache/calcite/sql/parser/SqlParser.java#L268
[Task :core:compileJava] package ImmutableSqlParser does not exist
Config DEFAULT = ImmutableSqlParser.Config.of();
^
|
Linux (JDK 8, latest Guava, America/New_York Timezone):
core/src/main/java/org/apache/calcite/rel/rules/AggregateRemoveRule.java#L169
[Task :core:compileJava] package ImmutableAggregateRemoveRule does not exist
Config DEFAULT = ImmutableAggregateRemoveRule.Config.of()
^
|
Linux (JDK 11, Pacific/Chatham Timezone):
task ':core:compileJava'#L1
Execution failed for task ':core:compileJava':
org.gradle.api.internal.tasks.compile.CompilationFailedException: Compilation failed; see the compiler error output for details.
at org.gradle.api.internal.tasks.compile.JdkJavaCompiler.execute(JdkJavaCompiler.java:61)
at org.gradle.api.internal.tasks.compile.JdkJavaCompiler.execute(JdkJavaCompiler.java:41)
at org.gradle.api.internal.tasks.compile.NormalizingJavaCompiler.delegateAndHandleErrors(NormalizingJavaCompiler.java:98)
at org.gradle.api.internal.tasks.compile.NormalizingJavaCompiler.execute(NormalizingJavaCompiler.java:52)
at org.gradle.api.internal.tasks.compile.NormalizingJavaCompiler.execute(NormalizingJavaCompiler.java:38)
at org.gradle.api.internal.tasks.compile.AnnotationProcessorDiscoveringCompiler.execute(AnnotationProcessorDiscoveringCompiler.java:52)
at org.gradle.api.internal.tasks.compile.AnnotationProcessorDiscoveringCompiler.execute(AnnotationProcessorDiscoveringCompiler.java:38)
at org.gradle.api.internal.tasks.compile.ModuleApplicationNameWritingCompiler.execute(ModuleApplicationNameWritingCompiler.java:46)
at org.gradle.api.internal.tasks.compile.ModuleApplicationNameWritingCompiler.execute(ModuleApplicationNameWritingCompiler.java:36)
at org.gradle.jvm.toolchain.internal.DefaultToolchainJavaCompiler.execute(DefaultToolchainJavaCompiler.java:57)
at org.gradle.api.tasks.compile.JavaCompile.lambda$createToolchainCompiler$3(JavaCompile.java:202)
at org.gradle.api.internal.tasks.compile.CleaningJavaCompiler.execute(CleaningJavaCompiler.java:53)
at org.gradle.api.internal.tasks.compile.incremental.IncrementalCompilerFactory.lambda$createRebuildAllCompiler$0(IncrementalCompilerFactory.java:52)
at org.gradle.api.internal.tasks.compile.incremental.SelectiveCompiler.execute(SelectiveCompiler.java:70)
at org.gradle.api.internal.tasks.compile.incremental.SelectiveCompiler.execute(SelectiveCompiler.java:44)
at org.gradle.api.internal.tasks.compile.incremental.IncrementalResultStoringCompiler.execute(IncrementalResultStoringCompiler.java:66)
at org.gradle.api.internal.tasks.compile.incremental.IncrementalResultStoringCompiler.execute(IncrementalResultStoringCompiler.java:52)
at org.gradle.api.internal.tasks.compile.CompileJavaBuildOperationReportingCompiler$1.call(CompileJavaBuildOperationReportingCompiler.java:64)
at org.gradle.api.internal.tasks.compile.CompileJavaBuildOperationReportingCompiler$1.call(CompileJavaBuildOperationReportingCompiler.java:48)
at org.gradle.internal.operations.DefaultBuildOperationRunner$CallableBuildOperationWorker.execute(DefaultBuildOperationRunner.java:200)
at org.gradle.internal.operations.DefaultBuildOperationRunner$CallableBuildOperationWorker.execute(DefaultBuildOperationRunner.java:195)
at org.gradle.internal.operations.DefaultBuildOperationRunner$2.execute(DefaultBuildOperationRunner.java:66)
at org.gradle.internal.operations.DefaultBuildOperationRunner$2.execute(DefaultBuildOperationRunner.java:59)
at org.gradle.internal.operations.DefaultBuildOperationRunner.execute(DefaultBuildOperationRunner.java:157)
at org.gradle.internal.operations.DefaultBuildOperationRunner.execute(DefaultBuildOperationRunner.java:59)
at org.gradle.internal.operations.DefaultBuildOperationRunner.call(DefaultBuildOperationRunner.java:53)
at org.gradle.internal.operations.DefaultBuildOperationExecutor.call(DefaultBuildOperationExecutor.java:73)
at org.gradle.api.internal.tasks.compile.CompileJavaBuildOperationReportingCompiler.execute(CompileJavaBuildOperationReportingCompiler.java:48)
at org.gradle.api.tasks.compile.JavaCompile.performCompilation(JavaCompile.java:220)
at org.gradle.api.tasks.compile.JavaCompile.performIncrementalCompilation(JavaCompile.java:161)
at org.gradle.api.tasks.compile.JavaCompile.compile(JavaCompile.java:146)
at org.gradle.internal.reflect.JavaMethod.invoke(JavaMethod.j
|
Linux (JDK 11, Pacific/Chatham Timezone)
Execution failed for task ':core:compileJava'.
> Compilation failed; see the compiler error output for details.
|
Linux (JDK 11, Pacific/Chatham Timezone):
core/src/main/java/org/apache/calcite/rel/stream/StreamRules.java#L343
[Task :core:compileJava] cannot find symbol
ImmutableDeltaTableScanToEmptyRuleConfig DEFAULT =
^
symbol: class ImmutableDeltaTableScanToEmptyRuleConfig
|
Linux (JDK 11, Pacific/Chatham Timezone):
core/src/main/java/org/apache/calcite/rel/rules/JoinDeriveIsNotNullFilterRule.java#L107
[Task :core:compileJava] package ImmutableJoinDeriveIsNotNullFilterRule does not exist
ImmutableJoinDeriveIsNotNullFilterRule.Config DEFAULT =
^
|
Linux (JDK 11, Pacific/Chatham Timezone):
core/src/main/java/org/apache/calcite/sql/fun/SqlLibraryOperators.java#L138
[Task :core:compileJava] LibraryOperator is not a repeatable annotation type
@LibraryOperator(libraries = {SPARK})
^
|
Linux (JDK 11, Pacific/Chatham Timezone):
core/src/main/java/org/apache/calcite/sql/validate/SqlValidator.java#L836
[Task :core:compileJava] package ImmutableSqlValidator does not exist
SqlValidator.Config DEFAULT = ImmutableSqlValidator.Config.builder()
^
|
Linux (JDK 11, Pacific/Chatham Timezone):
core/src/main/java/org/apache/calcite/sql/parser/SqlParser.java#L268
[Task :core:compileJava] package ImmutableSqlParser does not exist
Config DEFAULT = ImmutableSqlParser.Config.of();
^
|
Linux (JDK 11, Pacific/Chatham Timezone):
core/src/main/java/org/apache/calcite/sql2rel/SqlToRelConverter.java#L257
[Task :core:compileJava] package ImmutableSqlToRelConverter does not exist
ImmutableSqlToRelConverter.Config.builder()
^
|
Linux (JDK 11, Pacific/Chatham Timezone):
core/src/main/java/org/apache/calcite/rel/rules/AggregateRemoveRule.java#L169
[Task :core:compileJava] package ImmutableAggregateRemoveRule does not exist
Config DEFAULT = ImmutableAggregateRemoveRule.Config.of()
^
|
Linux (JDK 11, Pacific/Chatham Timezone):
core/src/main/java/org/apache/calcite/tools/RelBuilder.java#L5050
[Task :core:compileJava] package ImmutableRelBuilder does not exist
Config DEFAULT = ImmutableRelBuilder.Config.of();
^
|
Linux (JDK 23):
task ':core:compileJava'#L1
Execution failed for task ':core:compileJava':
org.gradle.api.internal.tasks.compile.CompilationFailedException: Compilation failed; see the compiler error output for details.
at org.gradle.api.internal.tasks.compile.JdkJavaCompiler.execute(JdkJavaCompiler.java:61)
at org.gradle.api.internal.tasks.compile.JdkJavaCompiler.execute(JdkJavaCompiler.java:41)
at org.gradle.api.internal.tasks.compile.NormalizingJavaCompiler.delegateAndHandleErrors(NormalizingJavaCompiler.java:98)
at org.gradle.api.internal.tasks.compile.NormalizingJavaCompiler.execute(NormalizingJavaCompiler.java:52)
at org.gradle.api.internal.tasks.compile.NormalizingJavaCompiler.execute(NormalizingJavaCompiler.java:38)
at org.gradle.api.internal.tasks.compile.AnnotationProcessorDiscoveringCompiler.execute(AnnotationProcessorDiscoveringCompiler.java:52)
at org.gradle.api.internal.tasks.compile.AnnotationProcessorDiscoveringCompiler.execute(AnnotationProcessorDiscoveringCompiler.java:38)
at org.gradle.api.internal.tasks.compile.ModuleApplicationNameWritingCompiler.execute(ModuleApplicationNameWritingCompiler.java:46)
at org.gradle.api.internal.tasks.compile.ModuleApplicationNameWritingCompiler.execute(ModuleApplicationNameWritingCompiler.java:36)
at org.gradle.jvm.toolchain.internal.DefaultToolchainJavaCompiler.execute(DefaultToolchainJavaCompiler.java:57)
at org.gradle.api.tasks.compile.JavaCompile.lambda$createToolchainCompiler$3(JavaCompile.java:202)
at org.gradle.api.internal.tasks.compile.CleaningJavaCompiler.execute(CleaningJavaCompiler.java:53)
at org.gradle.api.internal.tasks.compile.incremental.IncrementalCompilerFactory.lambda$createRebuildAllCompiler$0(IncrementalCompilerFactory.java:52)
at org.gradle.api.internal.tasks.compile.incremental.SelectiveCompiler.execute(SelectiveCompiler.java:70)
at org.gradle.api.internal.tasks.compile.incremental.SelectiveCompiler.execute(SelectiveCompiler.java:44)
at org.gradle.api.internal.tasks.compile.incremental.IncrementalResultStoringCompiler.execute(IncrementalResultStoringCompiler.java:66)
at org.gradle.api.internal.tasks.compile.incremental.IncrementalResultStoringCompiler.execute(IncrementalResultStoringCompiler.java:52)
at org.gradle.api.internal.tasks.compile.CompileJavaBuildOperationReportingCompiler$1.call(CompileJavaBuildOperationReportingCompiler.java:64)
at org.gradle.api.internal.tasks.compile.CompileJavaBuildOperationReportingCompiler$1.call(CompileJavaBuildOperationReportingCompiler.java:48)
at org.gradle.internal.operations.DefaultBuildOperationRunner$CallableBuildOperationWorker.execute(DefaultBuildOperationRunner.java:200)
at org.gradle.internal.operations.DefaultBuildOperationRunner$CallableBuildOperationWorker.execute(DefaultBuildOperationRunner.java:195)
at org.gradle.internal.operations.DefaultBuildOperationRunner$2.execute(DefaultBuildOperationRunner.java:66)
at org.gradle.internal.operations.DefaultBuildOperationRunner$2.execute(DefaultBuildOperationRunner.java:59)
at org.gradle.internal.operations.DefaultBuildOperationRunner.execute(DefaultBuildOperationRunner.java:157)
at org.gradle.internal.operations.DefaultBuildOperationRunner.execute(DefaultBuildOperationRunner.java:59)
at org.gradle.internal.operations.DefaultBuildOperationRunner.call(DefaultBuildOperationRunner.java:53)
at org.gradle.internal.operations.DefaultBuildOperationExecutor.call(DefaultBuildOperationExecutor.java:73)
at org.gradle.api.internal.tasks.compile.CompileJavaBuildOperationReportingCompiler.execute(CompileJavaBuildOperationReportingCompiler.java:48)
at org.gradle.api.tasks.compile.JavaCompile.performCompilation(JavaCompile.java:220)
at org.gradle.api.tasks.compile.JavaCompile.performIncrementalCompilation(JavaCompile.java:161)
at org.gradle.api.tasks.compile.JavaCompile.compile(JavaCompile.java:146)
at org.gradle.internal.reflect.JavaMethod.invoke(JavaMethod.j
|
Linux (JDK 23)
Execution failed for task ':core:compileJava'.
> Compilation failed; see the compiler error output for details.
|
Linux (JDK 23):
core/src/main/java/org/apache/calcite/sql/fun/SqlLibraryOperators.java#L138
[Task :core:compileJava] LibraryOperator is not a repeatable annotation interface
@LibraryOperator(libraries = {SPARK})
^
|
Linux (JDK 23):
core/src/main/java/org/apache/calcite/rel/stream/StreamRules.java#L343
[Task :core:compileJava] cannot find symbol
ImmutableDeltaTableScanToEmptyRuleConfig DEFAULT =
^
symbol: class ImmutableDeltaTableScanToEmptyRuleConfig
|
Linux (JDK 23):
core/src/main/java/org/apache/calcite/rel/rules/JoinDeriveIsNotNullFilterRule.java#L107
[Task :core:compileJava] package ImmutableJoinDeriveIsNotNullFilterRule does not exist
ImmutableJoinDeriveIsNotNullFilterRule.Config DEFAULT =
^
|
Linux (JDK 21):
task ':core:compileJava'#L1
Execution failed for task ':core:compileJava':
org.gradle.api.internal.tasks.compile.CompilationFailedException: Compilation failed; see the compiler error output for details.
at org.gradle.api.internal.tasks.compile.JdkJavaCompiler.execute(JdkJavaCompiler.java:61)
at org.gradle.api.internal.tasks.compile.JdkJavaCompiler.execute(JdkJavaCompiler.java:41)
at org.gradle.api.internal.tasks.compile.NormalizingJavaCompiler.delegateAndHandleErrors(NormalizingJavaCompiler.java:98)
at org.gradle.api.internal.tasks.compile.NormalizingJavaCompiler.execute(NormalizingJavaCompiler.java:52)
at org.gradle.api.internal.tasks.compile.NormalizingJavaCompiler.execute(NormalizingJavaCompiler.java:38)
at org.gradle.api.internal.tasks.compile.AnnotationProcessorDiscoveringCompiler.execute(AnnotationProcessorDiscoveringCompiler.java:52)
at org.gradle.api.internal.tasks.compile.AnnotationProcessorDiscoveringCompiler.execute(AnnotationProcessorDiscoveringCompiler.java:38)
at org.gradle.api.internal.tasks.compile.ModuleApplicationNameWritingCompiler.execute(ModuleApplicationNameWritingCompiler.java:46)
at org.gradle.api.internal.tasks.compile.ModuleApplicationNameWritingCompiler.execute(ModuleApplicationNameWritingCompiler.java:36)
at org.gradle.jvm.toolchain.internal.DefaultToolchainJavaCompiler.execute(DefaultToolchainJavaCompiler.java:57)
at org.gradle.api.tasks.compile.JavaCompile.lambda$createToolchainCompiler$3(JavaCompile.java:202)
at org.gradle.api.internal.tasks.compile.CleaningJavaCompiler.execute(CleaningJavaCompiler.java:53)
at org.gradle.api.internal.tasks.compile.incremental.IncrementalCompilerFactory.lambda$createRebuildAllCompiler$0(IncrementalCompilerFactory.java:52)
at org.gradle.api.internal.tasks.compile.incremental.SelectiveCompiler.execute(SelectiveCompiler.java:70)
at org.gradle.api.internal.tasks.compile.incremental.SelectiveCompiler.execute(SelectiveCompiler.java:44)
at org.gradle.api.internal.tasks.compile.incremental.IncrementalResultStoringCompiler.execute(IncrementalResultStoringCompiler.java:66)
at org.gradle.api.internal.tasks.compile.incremental.IncrementalResultStoringCompiler.execute(IncrementalResultStoringCompiler.java:52)
at org.gradle.api.internal.tasks.compile.CompileJavaBuildOperationReportingCompiler$1.call(CompileJavaBuildOperationReportingCompiler.java:64)
at org.gradle.api.internal.tasks.compile.CompileJavaBuildOperationReportingCompiler$1.call(CompileJavaBuildOperationReportingCompiler.java:48)
at org.gradle.internal.operations.DefaultBuildOperationRunner$CallableBuildOperationWorker.execute(DefaultBuildOperationRunner.java:200)
at org.gradle.internal.operations.DefaultBuildOperationRunner$CallableBuildOperationWorker.execute(DefaultBuildOperationRunner.java:195)
at org.gradle.internal.operations.DefaultBuildOperationRunner$2.execute(DefaultBuildOperationRunner.java:66)
at org.gradle.internal.operations.DefaultBuildOperationRunner$2.execute(DefaultBuildOperationRunner.java:59)
at org.gradle.internal.operations.DefaultBuildOperationRunner.execute(DefaultBuildOperationRunner.java:157)
at org.gradle.internal.operations.DefaultBuildOperationRunner.execute(DefaultBuildOperationRunner.java:59)
at org.gradle.internal.operations.DefaultBuildOperationRunner.call(DefaultBuildOperationRunner.java:53)
at org.gradle.internal.operations.DefaultBuildOperationExecutor.call(DefaultBuildOperationExecutor.java:73)
at org.gradle.api.internal.tasks.compile.CompileJavaBuildOperationReportingCompiler.execute(CompileJavaBuildOperationReportingCompiler.java:48)
at org.gradle.api.tasks.compile.JavaCompile.performCompilation(JavaCompile.java:220)
at org.gradle.api.tasks.compile.JavaCompile.performIncrementalCompilation(JavaCompile.java:161)
at org.gradle.api.tasks.compile.JavaCompile.compile(JavaCompile.java:146)
at org.gradle.internal.reflect.JavaMethod.invoke(JavaMethod.j
|
Linux (JDK 23):
core/src/main/java/org/apache/calcite/sql/validate/SqlValidator.java#L836
[Task :core:compileJava] package ImmutableSqlValidator does not exist
SqlValidator.Config DEFAULT = ImmutableSqlValidator.Config.builder()
^
|
Linux (JDK 21)
Execution failed for task ':core:compileJava'.
> Compilation failed; see the compiler error output for details.
|
Linux (JDK 23):
core/src/main/java/org/apache/calcite/sql/parser/SqlParser.java#L268
[Task :core:compileJava] package ImmutableSqlParser does not exist
Config DEFAULT = ImmutableSqlParser.Config.of();
^
|
Linux (JDK 21):
core/src/main/java/org/apache/calcite/rel/stream/StreamRules.java#L343
[Task :core:compileJava] cannot find symbol
ImmutableDeltaTableScanToEmptyRuleConfig DEFAULT =
^
symbol: class ImmutableDeltaTableScanToEmptyRuleConfig
|
Linux (JDK 23):
core/src/main/java/org/apache/calcite/sql2rel/SqlToRelConverter.java#L257
[Task :core:compileJava] package ImmutableSqlToRelConverter does not exist
ImmutableSqlToRelConverter.Config.builder()
^
|
Linux (JDK 23):
core/src/main/java/org/apache/calcite/rel/rules/AggregateRemoveRule.java#L169
[Task :core:compileJava] package ImmutableAggregateRemoveRule does not exist
Config DEFAULT = ImmutableAggregateRemoveRule.Config.of()
^
|
Linux (JDK 21):
core/src/main/java/org/apache/calcite/rel/rules/JoinDeriveIsNotNullFilterRule.java#L107
[Task :core:compileJava] package ImmutableJoinDeriveIsNotNullFilterRule does not exist
ImmutableJoinDeriveIsNotNullFilterRule.Config DEFAULT =
^
|
Linux (JDK 23):
core/src/main/java/org/apache/calcite/tools/RelBuilder.java#L5050
[Task :core:compileJava] package ImmutableRelBuilder does not exist
Config DEFAULT = ImmutableRelBuilder.Config.of();
^
|
Linux (JDK 21):
core/src/main/java/org/apache/calcite/sql/fun/SqlLibraryOperators.java#L138
[Task :core:compileJava] LibraryOperator is not a repeatable annotation interface
@LibraryOperator(libraries = {SPARK})
^
|
Linux (JDK 21):
core/src/main/java/org/apache/calcite/sql/validate/SqlValidator.java#L836
[Task :core:compileJava] package ImmutableSqlValidator does not exist
SqlValidator.Config DEFAULT = ImmutableSqlValidator.Config.builder()
^
|
Linux (JDK 21):
core/src/main/java/org/apache/calcite/sql/parser/SqlParser.java#L268
[Task :core:compileJava] package ImmutableSqlParser does not exist
Config DEFAULT = ImmutableSqlParser.Config.of();
^
|
Linux (JDK 21):
core/src/main/java/org/apache/calcite/sql2rel/SqlToRelConverter.java#L257
[Task :core:compileJava] package ImmutableSqlToRelConverter does not exist
ImmutableSqlToRelConverter.Config.builder()
^
|
Linux (JDK 21):
core/src/main/java/org/apache/calcite/rel/rules/AggregateRemoveRule.java#L169
[Task :core:compileJava] package ImmutableAggregateRemoveRule does not exist
Config DEFAULT = ImmutableAggregateRemoveRule.Config.of()
^
|
Linux (JDK 21):
core/src/main/java/org/apache/calcite/tools/RelBuilder.java#L5050
[Task :core:compileJava] package ImmutableRelBuilder does not exist
Config DEFAULT = ImmutableRelBuilder.Config.of();
^
|
Windows (JDK 17):
task ':core:compileJava'#L1
Execution failed for task ':core:compileJava':
org.gradle.api.internal.tasks.compile.CompilationFailedException: Compilation failed; see the compiler error output for details.
at org.gradle.api.internal.tasks.compile.JdkJavaCompiler.execute(JdkJavaCompiler.java:61)
at org.gradle.api.internal.tasks.compile.JdkJavaCompiler.execute(JdkJavaCompiler.java:41)
at org.gradle.api.internal.tasks.compile.NormalizingJavaCompiler.delegateAndHandleErrors(NormalizingJavaCompiler.java:98)
at org.gradle.api.internal.tasks.compile.NormalizingJavaCompiler.execute(NormalizingJavaCompiler.java:52)
at org.gradle.api.internal.tasks.compile.NormalizingJavaCompiler.execute(NormalizingJavaCompiler.java:38)
at org.gradle.api.internal.tasks.compile.AnnotationProcessorDiscoveringCompiler.execute(AnnotationProcessorDiscoveringCompiler.java:52)
at org.gradle.api.internal.tasks.compile.AnnotationProcessorDiscoveringCompiler.execute(AnnotationProcessorDiscoveringCompiler.java:38)
at org.gradle.api.internal.tasks.compile.ModuleApplicationNameWritingCompiler.execute(ModuleApplicationNameWritingCompiler.java:46)
at org.gradle.api.internal.tasks.compile.ModuleApplicationNameWritingCompiler.execute(ModuleApplicationNameWritingCompiler.java:36)
at org.gradle.jvm.toolchain.internal.DefaultToolchainJavaCompiler.execute(DefaultToolchainJavaCompiler.java:57)
at org.gradle.api.tasks.compile.JavaCompile.lambda$createToolchainCompiler$3(JavaCompile.java:202)
at org.gradle.api.internal.tasks.compile.CleaningJavaCompiler.execute(CleaningJavaCompiler.java:53)
at org.gradle.api.internal.tasks.compile.incremental.IncrementalCompilerFactory.lambda$createRebuildAllCompiler$0(IncrementalCompilerFactory.java:52)
at org.gradle.api.internal.tasks.compile.incremental.SelectiveCompiler.execute(SelectiveCompiler.java:70)
at org.gradle.api.internal.tasks.compile.incremental.SelectiveCompiler.execute(SelectiveCompiler.java:44)
at org.gradle.api.internal.tasks.compile.incremental.IncrementalResultStoringCompiler.execute(IncrementalResultStoringCompiler.java:66)
at org.gradle.api.internal.tasks.compile.incremental.IncrementalResultStoringCompiler.execute(IncrementalResultStoringCompiler.java:52)
at org.gradle.api.internal.tasks.compile.CompileJavaBuildOperationReportingCompiler$1.call(CompileJavaBuildOperationReportingCompiler.java:64)
at org.gradle.api.internal.tasks.compile.CompileJavaBuildOperationReportingCompiler$1.call(CompileJavaBuildOperationReportingCompiler.java:48)
at org.gradle.internal.operations.DefaultBuildOperationRunner$CallableBuildOperationWorker.execute(DefaultBuildOperationRunner.java:200)
at org.gradle.internal.operations.DefaultBuildOperationRunner$CallableBuildOperationWorker.execute(DefaultBuildOperationRunner.java:195)
at org.gradle.internal.operations.DefaultBuildOperationRunner$2.execute(DefaultBuildOperationRunner.java:66)
at org.gradle.internal.operations.DefaultBuildOperationRunner$2.execute(DefaultBuildOperationRunner.java:59)
at org.gradle.internal.operations.DefaultBuildOperationRunner.execute(DefaultBuildOperationRunner.java:157)
at org.gradle.internal.operations.DefaultBuildOperationRunner.execute(DefaultBuildOperationRunner.java:59)
at org.gradle.internal.operations.DefaultBuildOperationRunner.call(DefaultBuildOperationRunner.java:53)
at org.gradle.internal.operations.DefaultBuildOperationExecutor.call(DefaultBuildOperationExecutor.java:73)
at org.gradle.api.internal.tasks.compile.CompileJavaBuildOperationReportingCompiler.execute(CompileJavaBuildOperationReportingCompiler.java:48)
at org.gradle.api.tasks.compile.JavaCompile.performCompilation(JavaCompile.java:220)
at org.gradle.api.tasks.compile.JavaCompile.performIncrementalCompilation(JavaCompile.java:161)
at org.gradle.api.tasks.compile.JavaCompile.compile(JavaCompile.java:146)
at org.gradle.internal.refle
|
Windows (JDK 17)
Execution failed for task ':core:compileJava'.
> Compilation failed; see the compiler error output for details.
|
Windows (JDK 17):
\core\src\main\java\org\apache\calcite\rel\rules\JoinDeriveIsNotNullFilterRule.java#L107
[Task :core:compileJava] package ImmutableJoinDeriveIsNotNullFilterRule does not exist
ImmutableJoinDeriveIsNotNullFilterRule.Config DEFAULT =
^
|
Windows (JDK 17):
\core\src\main\java\org\apache\calcite\rel\stream\StreamRules.java#L343
[Task :core:compileJava] cannot find symbol
ImmutableDeltaTableScanToEmptyRuleConfig DEFAULT =
^
symbol: class ImmutableDeltaTableScanToEmptyRuleConfig
|
Windows (JDK 17):
\core\src\main\java\org\apache\calcite\sql\fun\SqlLibraryOperators.java#L138
[Task :core:compileJava] LibraryOperator is not a repeatable annotation type
@LibraryOperator(libraries = {SPARK})
^
|
Windows (JDK 17):
\core\src\main\java\org\apache\calcite\sql\validate\SqlValidator.java#L836
[Task :core:compileJava] package ImmutableSqlValidator does not exist
SqlValidator.Config DEFAULT = ImmutableSqlValidator.Config.builder()
^
|
Windows (JDK 17):
\core\src\main\java\org\apache\calcite\sql\parser\SqlParser.java#L268
[Task :core:compileJava] package ImmutableSqlParser does not exist
Config DEFAULT = ImmutableSqlParser.Config.of();
^
|
Windows (JDK 17):
\core\src\main\java\org\apache\calcite\sql2rel\SqlToRelConverter.java#L257
[Task :core:compileJava] package ImmutableSqlToRelConverter does not exist
ImmutableSqlToRelConverter.Config.builder()
^
|
Windows (JDK 17):
\core\src\main\java\org\apache\calcite\rel\rules\AggregateRemoveRule.java#L169
[Task :core:compileJava] package ImmutableAggregateRemoveRule does not exist
Config DEFAULT = ImmutableAggregateRemoveRule.Config.of()
^
|
Windows (JDK 17):
\core\src\main\java\org\apache\calcite\tools\RelBuilder.java#L5050
[Task :core:compileJava] package ImmutableRelBuilder does not exist
Config DEFAULT = ImmutableRelBuilder.Config.of();
^
|
Windows (JDK 21):
task ':core:compileJava'#L1
Execution failed for task ':core:compileJava':
org.gradle.api.internal.tasks.compile.CompilationFailedException: Compilation failed; see the compiler error output for details.
at org.gradle.api.internal.tasks.compile.JdkJavaCompiler.execute(JdkJavaCompiler.java:61)
at org.gradle.api.internal.tasks.compile.JdkJavaCompiler.execute(JdkJavaCompiler.java:41)
at org.gradle.api.internal.tasks.compile.NormalizingJavaCompiler.delegateAndHandleErrors(NormalizingJavaCompiler.java:98)
at org.gradle.api.internal.tasks.compile.NormalizingJavaCompiler.execute(NormalizingJavaCompiler.java:52)
at org.gradle.api.internal.tasks.compile.NormalizingJavaCompiler.execute(NormalizingJavaCompiler.java:38)
at org.gradle.api.internal.tasks.compile.AnnotationProcessorDiscoveringCompiler.execute(AnnotationProcessorDiscoveringCompiler.java:52)
at org.gradle.api.internal.tasks.compile.AnnotationProcessorDiscoveringCompiler.execute(AnnotationProcessorDiscoveringCompiler.java:38)
at org.gradle.api.internal.tasks.compile.ModuleApplicationNameWritingCompiler.execute(ModuleApplicationNameWritingCompiler.java:46)
at org.gradle.api.internal.tasks.compile.ModuleApplicationNameWritingCompiler.execute(ModuleApplicationNameWritingCompiler.java:36)
at org.gradle.jvm.toolchain.internal.DefaultToolchainJavaCompiler.execute(DefaultToolchainJavaCompiler.java:57)
at org.gradle.api.tasks.compile.JavaCompile.lambda$createToolchainCompiler$3(JavaCompile.java:202)
at org.gradle.api.internal.tasks.compile.CleaningJavaCompiler.execute(CleaningJavaCompiler.java:53)
at org.gradle.api.internal.tasks.compile.incremental.IncrementalCompilerFactory.lambda$createRebuildAllCompiler$0(IncrementalCompilerFactory.java:52)
at org.gradle.api.internal.tasks.compile.incremental.SelectiveCompiler.execute(SelectiveCompiler.java:70)
at org.gradle.api.internal.tasks.compile.incremental.SelectiveCompiler.execute(SelectiveCompiler.java:44)
at org.gradle.api.internal.tasks.compile.incremental.IncrementalResultStoringCompiler.execute(IncrementalResultStoringCompiler.java:66)
at org.gradle.api.internal.tasks.compile.incremental.IncrementalResultStoringCompiler.execute(IncrementalResultStoringCompiler.java:52)
at org.gradle.api.internal.tasks.compile.CompileJavaBuildOperationReportingCompiler$1.call(CompileJavaBuildOperationReportingCompiler.java:64)
at org.gradle.api.internal.tasks.compile.CompileJavaBuildOperationReportingCompiler$1.call(CompileJavaBuildOperationReportingCompiler.java:48)
at org.gradle.internal.operations.DefaultBuildOperationRunner$CallableBuildOperationWorker.execute(DefaultBuildOperationRunner.java:200)
at org.gradle.internal.operations.DefaultBuildOperationRunner$CallableBuildOperationWorker.execute(DefaultBuildOperationRunner.java:195)
at org.gradle.internal.operations.DefaultBuildOperationRunner$2.execute(DefaultBuildOperationRunner.java:66)
at org.gradle.internal.operations.DefaultBuildOperationRunner$2.execute(DefaultBuildOperationRunner.java:59)
at org.gradle.internal.operations.DefaultBuildOperationRunner.execute(DefaultBuildOperationRunner.java:157)
at org.gradle.internal.operations.DefaultBuildOperationRunner.execute(DefaultBuildOperationRunner.java:59)
at org.gradle.internal.operations.DefaultBuildOperationRunner.call(DefaultBuildOperationRunner.java:53)
at org.gradle.internal.operations.DefaultBuildOperationExecutor.call(DefaultBuildOperationExecutor.java:73)
at org.gradle.api.internal.tasks.compile.CompileJavaBuildOperationReportingCompiler.execute(CompileJavaBuildOperationReportingCompiler.java:48)
at org.gradle.api.tasks.compile.JavaCompile.performCompilation(JavaCompile.java:220)
at org.gradle.api.tasks.compile.JavaCompile.performIncrementalCompilation(JavaCompile.java:161)
at org.gradle.api.tasks.compile.JavaCompile.compile(JavaCompile.java:146)
at org.gradle.internal.refle
|
Windows (JDK 21)
Execution failed for task ':core:compileJava'.
> Compilation failed; see the compiler error output for details.
|
Windows (JDK 21):
\core\src\main\java\org\apache\calcite\rel\rules\JoinDeriveIsNotNullFilterRule.java#L107
[Task :core:compileJava] package ImmutableJoinDeriveIsNotNullFilterRule does not exist
ImmutableJoinDeriveIsNotNullFilterRule.Config DEFAULT =
^
|
Windows (JDK 21):
\core\src\main\java\org\apache\calcite\rel\stream\StreamRules.java#L343
[Task :core:compileJava] cannot find symbol
ImmutableDeltaTableScanToEmptyRuleConfig DEFAULT =
^
symbol: class ImmutableDeltaTableScanToEmptyRuleConfig
|
Windows (JDK 21):
\core\src\main\java\org\apache\calcite\sql\fun\SqlLibraryOperators.java#L138
[Task :core:compileJava] LibraryOperator is not a repeatable annotation interface
@LibraryOperator(libraries = {SPARK})
^
|
Windows (JDK 21):
\core\src\main\java\org\apache\calcite\sql\validate\SqlValidator.java#L836
[Task :core:compileJava] package ImmutableSqlValidator does not exist
SqlValidator.Config DEFAULT = ImmutableSqlValidator.Config.builder()
^
|
Windows (JDK 21):
\core\src\main\java\org\apache\calcite\sql\parser\SqlParser.java#L268
[Task :core:compileJava] package ImmutableSqlParser does not exist
Config DEFAULT = ImmutableSqlParser.Config.of();
^
|
Windows (JDK 21):
\core\src\main\java\org\apache\calcite\sql2rel\SqlToRelConverter.java#L257
[Task :core:compileJava] package ImmutableSqlToRelConverter does not exist
ImmutableSqlToRelConverter.Config.builder()
^
|
Windows (JDK 21):
\core\src\main\java\org\apache\calcite\rel\rules\AggregateRemoveRule.java#L169
[Task :core:compileJava] package ImmutableAggregateRemoveRule does not exist
Config DEFAULT = ImmutableAggregateRemoveRule.Config.of()
^
|
Windows (JDK 21):
\core\src\main\java\org\apache\calcite\tools\RelBuilder.java#L5050
[Task :core:compileJava] package ImmutableRelBuilder does not exist
Config DEFAULT = ImmutableRelBuilder.Config.of();
^
|
CheckerFramework (JDK 11):
task ':core:compileJava'#L1
Execution failed for task ':core:compileJava':
org.gradle.api.internal.tasks.compile.CompilationFailedException: Compilation failed; see the compiler error output for details.
at org.gradle.api.internal.tasks.compile.JdkJavaCompiler.execute(JdkJavaCompiler.java:61)
at org.gradle.api.internal.tasks.compile.JdkJavaCompiler.execute(JdkJavaCompiler.java:41)
at org.gradle.api.internal.tasks.compile.daemon.AbstractIsolatedCompilerWorkerExecutor$CompilerWorkAction.execute(AbstractIsolatedCompilerWorkerExecutor.java:78)
at org.gradle.workers.internal.DefaultWorkerServer.execute(DefaultWorkerServer.java:63)
at org.gradle.workers.internal.AbstractClassLoaderWorker$1.create(AbstractClassLoaderWorker.java:54)
at org.gradle.workers.internal.AbstractClassLoaderWorker$1.create(AbstractClassLoaderWorker.java:48)
at org.gradle.internal.classloader.ClassLoaderUtils.executeInClassloader(ClassLoaderUtils.java:100)
at org.gradle.workers.internal.AbstractClassLoaderWorker.executeInClassLoader(AbstractClassLoaderWorker.java:48)
at org.gradle.workers.internal.FlatClassLoaderWorker.run(FlatClassLoaderWorker.java:32)
at org.gradle.workers.internal.FlatClassLoaderWorker.run(FlatClassLoaderWorker.java:22)
at org.gradle.workers.internal.WorkerDaemonServer.run(WorkerDaemonServer.java:102)
at org.gradle.workers.internal.WorkerDaemonServer.run(WorkerDaemonServer.java:71)
at org.gradle.process.internal.worker.request.WorkerAction$1.call(WorkerAction.java:146)
at org.gradle.process.internal.worker.child.WorkerLogEventListener.withWorkerLoggingProtocol(WorkerLogEventListener.java:41)
at org.gradle.process.internal.worker.request.WorkerAction.lambda$run$0(WorkerAction.java:143)
at org.gradle.internal.operations.CurrentBuildOperationRef.with(CurrentBuildOperationRef.java:80)
at org.gradle.process.internal.worker.request.WorkerAction.run(WorkerAction.java:135)
at org.gradle.internal.dispatch.ReflectionDispatch.dispatch(ReflectionDispatch.java:36)
at org.gradle.internal.dispatch.ReflectionDispatch.dispatch(ReflectionDispatch.java:24)
at org.gradle.internal.remote.internal.hub.MessageHubBackedObjectConnection$DispatchWrapper.dispatch(MessageHubBackedObjectConnection.java:182)
at org.gradle.internal.remote.internal.hub.MessageHubBackedObjectConnection$DispatchWrapper.dispatch(MessageHubBackedObjectConnection.java:164)
at org.gradle.internal.remote.internal.hub.MessageHub$Handler.run(MessageHub.java:414)
at org.gradle.internal.concurrent.ExecutorPolicy$CatchAndRecordFailures.onExecute(ExecutorPolicy.java:64)
at org.gradle.internal.concurrent.AbstractManagedExecutor$1.run(AbstractManagedExecutor.java:47)
at java.base/java.util.concurrent.ThreadPoolExecutor.runWorker(ThreadPoolExecutor.java:1128)
at java.base/java.util.concurrent.ThreadPoolExecutor$Worker.run(ThreadPoolExecutor.java:628)
at java.base/java.lang.Thread.run(Thread.java:829)
|
CheckerFramework (JDK 11)
Execution failed for task ':core:compileJava'.
> Compilation failed; see the compiler error output for details.
|
CheckerFramework (JDK 11):
core/src/main/java/org/apache/calcite/rel/stream/StreamRules.java#L343
[Task :core:compileJava] cannot find symbol
ImmutableDeltaTableScanToEmptyRuleConfig DEFAULT =
^
symbol: class ImmutableDeltaTableScanToEmptyRuleConfig
|
CheckerFramework (JDK 11):
core/src/main/java/org/apache/calcite/rel/rules/JoinDeriveIsNotNullFilterRule.java#L107
[Task :core:compileJava] package ImmutableJoinDeriveIsNotNullFilterRule does not exist
ImmutableJoinDeriveIsNotNullFilterRule.Config DEFAULT =
^
|
CheckerFramework (JDK 11):
core/src/main/java/org/apache/calcite/sql/fun/SqlLibraryOperators.java#L138
[Task :core:compileJava] LibraryOperator is not a repeatable annotation type
@LibraryOperator(libraries = {SPARK})
^
|
CheckerFramework (JDK 11):
core/src/main/java/org/apache/calcite/sql/validate/SqlValidator.java#L836
[Task :core:compileJava] package ImmutableSqlValidator does not exist
SqlValidator.Config DEFAULT = ImmutableSqlValidator.Config.builder()
^
|
CheckerFramework (JDK 11):
core/src/main/java/org/apache/calcite/sql/parser/SqlParser.java#L268
[Task :core:compileJava] package ImmutableSqlParser does not exist
Config DEFAULT = ImmutableSqlParser.Config.of();
^
|
CheckerFramework (JDK 11):
core/src/main/java/org/apache/calcite/sql2rel/SqlToRelConverter.java#L257
[Task :core:compileJava] package ImmutableSqlToRelConverter does not exist
ImmutableSqlToRelConverter.Config.builder()
^
|
CheckerFramework (JDK 11):
core/src/main/java/org/apache/calcite/rel/rules/AggregateRemoveRule.java#L169
[Task :core:compileJava] package ImmutableAggregateRemoveRule does not exist
Config DEFAULT = ImmutableAggregateRemoveRule.Config.of()
^
|
CheckerFramework (JDK 11):
core/src/main/java/org/apache/calcite/tools/RelBuilder.java#L5050
[Task :core:compileJava] package ImmutableRelBuilder does not exist
Config DEFAULT = ImmutableRelBuilder.Config.of();
^
|
CheckerFramework (JDK 11, oldest Guava):
task ':core:compileJava'#L1
Execution failed for task ':core:compileJava':
org.gradle.api.internal.tasks.compile.CompilationFailedException: Compilation failed; see the compiler error output for details.
at org.gradle.api.internal.tasks.compile.JdkJavaCompiler.execute(JdkJavaCompiler.java:61)
at org.gradle.api.internal.tasks.compile.JdkJavaCompiler.execute(JdkJavaCompiler.java:41)
at org.gradle.api.internal.tasks.compile.daemon.AbstractIsolatedCompilerWorkerExecutor$CompilerWorkAction.execute(AbstractIsolatedCompilerWorkerExecutor.java:78)
at org.gradle.workers.internal.DefaultWorkerServer.execute(DefaultWorkerServer.java:63)
at org.gradle.workers.internal.AbstractClassLoaderWorker$1.create(AbstractClassLoaderWorker.java:54)
at org.gradle.workers.internal.AbstractClassLoaderWorker$1.create(AbstractClassLoaderWorker.java:48)
at org.gradle.internal.classloader.ClassLoaderUtils.executeInClassloader(ClassLoaderUtils.java:100)
at org.gradle.workers.internal.AbstractClassLoaderWorker.executeInClassLoader(AbstractClassLoaderWorker.java:48)
at org.gradle.workers.internal.FlatClassLoaderWorker.run(FlatClassLoaderWorker.java:32)
at org.gradle.workers.internal.FlatClassLoaderWorker.run(FlatClassLoaderWorker.java:22)
at org.gradle.workers.internal.WorkerDaemonServer.run(WorkerDaemonServer.java:102)
at org.gradle.workers.internal.WorkerDaemonServer.run(WorkerDaemonServer.java:71)
at org.gradle.process.internal.worker.request.WorkerAction$1.call(WorkerAction.java:146)
at org.gradle.process.internal.worker.child.WorkerLogEventListener.withWorkerLoggingProtocol(WorkerLogEventListener.java:41)
at org.gradle.process.internal.worker.request.WorkerAction.lambda$run$0(WorkerAction.java:143)
at org.gradle.internal.operations.CurrentBuildOperationRef.with(CurrentBuildOperationRef.java:80)
at org.gradle.process.internal.worker.request.WorkerAction.run(WorkerAction.java:135)
at org.gradle.internal.dispatch.ReflectionDispatch.dispatch(ReflectionDispatch.java:36)
at org.gradle.internal.dispatch.ReflectionDispatch.dispatch(ReflectionDispatch.java:24)
at org.gradle.internal.remote.internal.hub.MessageHubBackedObjectConnection$DispatchWrapper.dispatch(MessageHubBackedObjectConnection.java:182)
at org.gradle.internal.remote.internal.hub.MessageHubBackedObjectConnection$DispatchWrapper.dispatch(MessageHubBackedObjectConnection.java:164)
at org.gradle.internal.remote.internal.hub.MessageHub$Handler.run(MessageHub.java:414)
at org.gradle.internal.concurrent.ExecutorPolicy$CatchAndRecordFailures.onExecute(ExecutorPolicy.java:64)
at org.gradle.internal.concurrent.AbstractManagedExecutor$1.run(AbstractManagedExecutor.java:47)
at java.base/java.util.concurrent.ThreadPoolExecutor.runWorker(ThreadPoolExecutor.java:1128)
at java.base/java.util.concurrent.ThreadPoolExecutor$Worker.run(ThreadPoolExecutor.java:628)
at java.base/java.lang.Thread.run(Thread.java:829)
|
CheckerFramework (JDK 11, oldest Guava)
Execution failed for task ':core:compileJava'.
> Compilation failed; see the compiler error output for details.
|
CheckerFramework (JDK 11, oldest Guava):
core/src/main/java/org/apache/calcite/rel/stream/StreamRules.java#L343
[Task :core:compileJava] cannot find symbol
ImmutableDeltaTableScanToEmptyRuleConfig DEFAULT =
^
symbol: class ImmutableDeltaTableScanToEmptyRuleConfig
|
CheckerFramework (JDK 11, oldest Guava):
core/src/main/java/org/apache/calcite/rel/rules/JoinDeriveIsNotNullFilterRule.java#L107
[Task :core:compileJava] package ImmutableJoinDeriveIsNotNullFilterRule does not exist
ImmutableJoinDeriveIsNotNullFilterRule.Config DEFAULT =
^
|
CheckerFramework (JDK 11, oldest Guava):
core/src/main/java/org/apache/calcite/sql/fun/SqlLibraryOperators.java#L138
[Task :core:compileJava] LibraryOperator is not a repeatable annotation type
@LibraryOperator(libraries = {SPARK})
^
|
CheckerFramework (JDK 11, oldest Guava):
core/src/main/java/org/apache/calcite/sql/validate/SqlValidator.java#L836
[Task :core:compileJava] package ImmutableSqlValidator does not exist
SqlValidator.Config DEFAULT = ImmutableSqlValidator.Config.builder()
^
|
CheckerFramework (JDK 11, oldest Guava):
core/src/main/java/org/apache/calcite/sql/parser/SqlParser.java#L268
[Task :core:compileJava] package ImmutableSqlParser does not exist
Config DEFAULT = ImmutableSqlParser.Config.of();
^
|
CheckerFramework (JDK 11, oldest Guava):
core/src/main/java/org/apache/calcite/sql2rel/SqlToRelConverter.java#L257
[Task :core:compileJava] package ImmutableSqlToRelConverter does not exist
ImmutableSqlToRelConverter.Config.builder()
^
|
CheckerFramework (JDK 11, oldest Guava):
core/src/main/java/org/apache/calcite/rel/rules/AggregateRemoveRule.java#L169
[Task :core:compileJava] package ImmutableAggregateRemoveRule does not exist
Config DEFAULT = ImmutableAggregateRemoveRule.Config.of()
^
|
CheckerFramework (JDK 11, oldest Guava):
core/src/main/java/org/apache/calcite/tools/RelBuilder.java#L5050
[Task :core:compileJava] package ImmutableRelBuilder does not exist
Config DEFAULT = ImmutableRelBuilder.Config.of();
^
|
Druid Tests:
task ':core:compileJava'#L1
Execution failed for task ':core:compileJava':
org.gradle.api.internal.tasks.compile.CompilationFailedException: Compilation failed; see the compiler error output for details.
at org.gradle.api.internal.tasks.compile.JdkJavaCompiler.execute(JdkJavaCompiler.java:61)
at org.gradle.api.internal.tasks.compile.JdkJavaCompiler.execute(JdkJavaCompiler.java:41)
at org.gradle.api.internal.tasks.compile.NormalizingJavaCompiler.delegateAndHandleErrors(NormalizingJavaCompiler.java:98)
at org.gradle.api.internal.tasks.compile.NormalizingJavaCompiler.execute(NormalizingJavaCompiler.java:52)
at org.gradle.api.internal.tasks.compile.NormalizingJavaCompiler.execute(NormalizingJavaCompiler.java:38)
at org.gradle.api.internal.tasks.compile.AnnotationProcessorDiscoveringCompiler.execute(AnnotationProcessorDiscoveringCompiler.java:52)
at org.gradle.api.internal.tasks.compile.AnnotationProcessorDiscoveringCompiler.execute(AnnotationProcessorDiscoveringCompiler.java:38)
at org.gradle.api.internal.tasks.compile.ModuleApplicationNameWritingCompiler.execute(ModuleApplicationNameWritingCompiler.java:46)
at org.gradle.api.internal.tasks.compile.ModuleApplicationNameWritingCompiler.execute(ModuleApplicationNameWritingCompiler.java:36)
at org.gradle.jvm.toolchain.internal.DefaultToolchainJavaCompiler.execute(DefaultToolchainJavaCompiler.java:57)
at org.gradle.api.tasks.compile.JavaCompile.lambda$createToolchainCompiler$3(JavaCompile.java:202)
at org.gradle.api.internal.tasks.compile.CleaningJavaCompiler.execute(CleaningJavaCompiler.java:53)
at org.gradle.api.internal.tasks.compile.incremental.IncrementalCompilerFactory.lambda$createRebuildAllCompiler$0(IncrementalCompilerFactory.java:52)
at org.gradle.api.internal.tasks.compile.incremental.SelectiveCompiler.execute(SelectiveCompiler.java:70)
at org.gradle.api.internal.tasks.compile.incremental.SelectiveCompiler.execute(SelectiveCompiler.java:44)
at org.gradle.api.internal.tasks.compile.incremental.IncrementalResultStoringCompiler.execute(IncrementalResultStoringCompiler.java:66)
at org.gradle.api.internal.tasks.compile.incremental.IncrementalResultStoringCompiler.execute(IncrementalResultStoringCompiler.java:52)
at org.gradle.api.internal.tasks.compile.CompileJavaBuildOperationReportingCompiler$1.call(CompileJavaBuildOperationReportingCompiler.java:64)
at org.gradle.api.internal.tasks.compile.CompileJavaBuildOperationReportingCompiler$1.call(CompileJavaBuildOperationReportingCompiler.java:48)
at org.gradle.internal.operations.DefaultBuildOperationRunner$CallableBuildOperationWorker.execute(DefaultBuildOperationRunner.java:200)
at org.gradle.internal.operations.DefaultBuildOperationRunner$CallableBuildOperationWorker.execute(DefaultBuildOperationRunner.java:195)
at org.gradle.internal.operations.DefaultBuildOperationRunner$2.execute(DefaultBuildOperationRunner.java:66)
at org.gradle.internal.operations.DefaultBuildOperationRunner$2.execute(DefaultBuildOperationRunner.java:59)
at org.gradle.internal.operations.DefaultBuildOperationRunner.execute(DefaultBuildOperationRunner.java:157)
at org.gradle.internal.operations.DefaultBuildOperationRunner.execute(DefaultBuildOperationRunner.java:59)
at org.gradle.internal.operations.DefaultBuildOperationRunner.call(DefaultBuildOperationRunner.java:53)
at org.gradle.internal.operations.DefaultBuildOperationExecutor.call(DefaultBuildOperationExecutor.java:73)
at org.gradle.api.internal.tasks.compile.CompileJavaBuildOperationReportingCompiler.execute(CompileJavaBuildOperationReportingCompiler.java:48)
at org.gradle.api.tasks.compile.JavaCompile.performCompilation(JavaCompile.java:220)
at org.gradle.api.tasks.compile.JavaCompile.performIncrementalCompilation(JavaCompile.java:161)
at org.gradle.api.tasks.compile.JavaCompile.compile(JavaCompile.java:146)
at org.gradle.internal.reflect.JavaMethod.invoke(JavaMethod.j
|
Druid Tests
Execution failed for task ':core:compileJava'.
> Compilation failed; see the compiler error output for details.
|
Druid Tests:
core/src/main/java/org/apache/calcite/rel/stream/StreamRules.java#L343
[Task :core:compileJava] cannot find symbol
ImmutableDeltaTableScanToEmptyRuleConfig DEFAULT =
^
symbol: class ImmutableDeltaTableScanToEmptyRuleConfig
|
Druid Tests:
core/src/main/java/org/apache/calcite/rel/rules/JoinDeriveIsNotNullFilterRule.java#L107
[Task :core:compileJava] package ImmutableJoinDeriveIsNotNullFilterRule does not exist
ImmutableJoinDeriveIsNotNullFilterRule.Config DEFAULT =
^
|
Druid Tests:
core/src/main/java/org/apache/calcite/sql/fun/SqlLibraryOperators.java#L138
[Task :core:compileJava] LibraryOperator is not a repeatable annotation type
@LibraryOperator(libraries = {SPARK})
^
|
Druid Tests:
core/src/main/java/org/apache/calcite/sql/validate/SqlValidator.java#L836
[Task :core:compileJava] package ImmutableSqlValidator does not exist
SqlValidator.Config DEFAULT = ImmutableSqlValidator.Config.builder()
^
|
Druid Tests:
core/src/main/java/org/apache/calcite/sql/parser/SqlParser.java#L268
[Task :core:compileJava] package ImmutableSqlParser does not exist
Config DEFAULT = ImmutableSqlParser.Config.of();
^
|
Druid Tests:
core/src/main/java/org/apache/calcite/sql2rel/SqlToRelConverter.java#L257
[Task :core:compileJava] package ImmutableSqlToRelConverter does not exist
ImmutableSqlToRelConverter.Config.builder()
^
|
Druid Tests:
core/src/main/java/org/apache/calcite/rel/rules/AggregateRemoveRule.java#L169
[Task :core:compileJava] package ImmutableAggregateRemoveRule does not exist
Config DEFAULT = ImmutableAggregateRemoveRule.Config.of()
^
|
Druid Tests:
core/src/main/java/org/apache/calcite/tools/RelBuilder.java#L5050
[Task :core:compileJava] package ImmutableRelBuilder does not exist
Config DEFAULT = ImmutableRelBuilder.Config.of();
^
|
Windows (JDK 8):
task ':core:compileJava'#L1
Execution failed for task ':core:compileJava':
org.gradle.api.internal.tasks.compile.CompilationFailedException: Compilation failed; see the compiler error output for details.
at org.gradle.api.internal.tasks.compile.JdkJavaCompiler.execute(JdkJavaCompiler.java:61)
at org.gradle.api.internal.tasks.compile.JdkJavaCompiler.execute(JdkJavaCompiler.java:41)
at org.gradle.api.internal.tasks.compile.NormalizingJavaCompiler.delegateAndHandleErrors(NormalizingJavaCompiler.java:98)
at org.gradle.api.internal.tasks.compile.NormalizingJavaCompiler.execute(NormalizingJavaCompiler.java:52)
at org.gradle.api.internal.tasks.compile.NormalizingJavaCompiler.execute(NormalizingJavaCompiler.java:38)
at org.gradle.api.internal.tasks.compile.AnnotationProcessorDiscoveringCompiler.execute(AnnotationProcessorDiscoveringCompiler.java:52)
at org.gradle.api.internal.tasks.compile.AnnotationProcessorDiscoveringCompiler.execute(AnnotationProcessorDiscoveringCompiler.java:38)
at org.gradle.api.internal.tasks.compile.ModuleApplicationNameWritingCompiler.execute(ModuleApplicationNameWritingCompiler.java:46)
at org.gradle.api.internal.tasks.compile.ModuleApplicationNameWritingCompiler.execute(ModuleApplicationNameWritingCompiler.java:36)
at org.gradle.jvm.toolchain.internal.DefaultToolchainJavaCompiler.execute(DefaultToolchainJavaCompiler.java:57)
at org.gradle.api.tasks.compile.JavaCompile.lambda$createToolchainCompiler$3(JavaCompile.java:202)
at org.gradle.api.internal.tasks.compile.CleaningJavaCompiler.execute(CleaningJavaCompiler.java:53)
at org.gradle.api.internal.tasks.compile.incremental.IncrementalCompilerFactory.lambda$createRebuildAllCompiler$0(IncrementalCompilerFactory.java:52)
at org.gradle.api.internal.tasks.compile.incremental.SelectiveCompiler.execute(SelectiveCompiler.java:70)
at org.gradle.api.internal.tasks.compile.incremental.SelectiveCompiler.execute(SelectiveCompiler.java:44)
at org.gradle.api.internal.tasks.compile.incremental.IncrementalResultStoringCompiler.execute(IncrementalResultStoringCompiler.java:66)
at org.gradle.api.internal.tasks.compile.incremental.IncrementalResultStoringCompiler.execute(IncrementalResultStoringCompiler.java:52)
at org.gradle.api.internal.tasks.compile.CompileJavaBuildOperationReportingCompiler$1.call(CompileJavaBuildOperationReportingCompiler.java:64)
at org.gradle.api.internal.tasks.compile.CompileJavaBuildOperationReportingCompiler$1.call(CompileJavaBuildOperationReportingCompiler.java:48)
at org.gradle.internal.operations.DefaultBuildOperationRunner$CallableBuildOperationWorker.execute(DefaultBuildOperationRunner.java:200)
at org.gradle.internal.operations.DefaultBuildOperationRunner$CallableBuildOperationWorker.execute(DefaultBuildOperationRunner.java:195)
at org.gradle.internal.operations.DefaultBuildOperationRunner$2.execute(DefaultBuildOperationRunner.java:66)
at org.gradle.internal.operations.DefaultBuildOperationRunner$2.execute(DefaultBuildOperationRunner.java:59)
at org.gradle.internal.operations.DefaultBuildOperationRunner.execute(DefaultBuildOperationRunner.java:157)
at org.gradle.internal.operations.DefaultBuildOperationRunner.execute(DefaultBuildOperationRunner.java:59)
at org.gradle.internal.operations.DefaultBuildOperationRunner.call(DefaultBuildOperationRunner.java:53)
at org.gradle.internal.operations.DefaultBuildOperationExecutor.call(DefaultBuildOperationExecutor.java:73)
at org.gradle.api.internal.tasks.compile.CompileJavaBuildOperationReportingCompiler.execute(CompileJavaBuildOperationReportingCompiler.java:48)
at org.gradle.api.tasks.compile.JavaCompile.performCompilation(JavaCompile.java:220)
at org.gradle.api.tasks.compile.JavaCompile.performIncrementalCompilation(JavaCompile.java:161)
at org.gradle.api.tasks.compile.JavaCompile.compile(JavaCompile.java:146)
at org.gradle.internal.refle
|
Windows (JDK 8)
Execution failed for task ':core:compileJava'.
> Compilation failed; see the compiler error output for details.
|
Windows (JDK 8):
\core\src\main\java\org\apache\calcite\rel\rules\JoinDeriveIsNotNullFilterRule.java#L107
[Task :core:compileJava] package ImmutableJoinDeriveIsNotNullFilterRule does not exist
ImmutableJoinDeriveIsNotNullFilterRule.Config DEFAULT =
^
|
Windows (JDK 8):
\core\src\main\java\org\apache\calcite\rel\stream\StreamRules.java#L343
[Task :core:compileJava] cannot find symbol
ImmutableDeltaTableScanToEmptyRuleConfig DEFAULT =
^
symbol: class ImmutableDeltaTableScanToEmptyRuleConfig
|
Windows (JDK 8):
\core\src\main\java\org\apache\calcite\sql\fun\SqlLibraryOperators.java#L138
[Task :core:compileJava] org.apache.calcite.sql.fun.LibraryOperator is not a repeatable annotation type
@LibraryOperator(libraries = {SPARK})
^
|
Windows (JDK 8):
\core\src\main\java\org\apache\calcite\sql\validate\SqlValidator.java#L836
[Task :core:compileJava] package ImmutableSqlValidator does not exist
SqlValidator.Config DEFAULT = ImmutableSqlValidator.Config.builder()
^
|
Windows (JDK 8):
\core\src\main\java\org\apache\calcite\sql\SqlWriterConfig.java#L432
[Task :core:compileJava] cannot find symbol
return ImmutableSqlWriterConfig.of();
^
symbol: variable ImmutableSqlWriterConfig
|
Windows (JDK 8):
\core\src\main\java\org\apache\calcite\sql\parser\SqlParser.java#L268
[Task :core:compileJava] package ImmutableSqlParser does not exist
Config DEFAULT = ImmutableSqlParser.Config.of();
^
|
Windows (JDK 8):
\core\src\main\java\org\apache\calcite\rel\convert\ConverterRule.java#L114
[Task :core:compileJava] package ImmutableConverterRule does not exist
this(ImmutableConverterRule.Config.builder()
^
|
Windows (JDK 8):
\core\src\main\java\org\apache\calcite\rel\convert\ConverterRule.java#L187
[Task :core:compileJava] package ImmutableConverterRule does not exist
Config INSTANCE = ImmutableConverterRule.Config.builder()
^
|
Linux (JDK 11, Avatica main):
task ':core:compileJava'#L1
Execution failed for task ':core:compileJava':
org.gradle.api.internal.tasks.compile.CompilationFailedException: Compilation failed; see the compiler error output for details.
at org.gradle.api.internal.tasks.compile.JdkJavaCompiler.execute(JdkJavaCompiler.java:61)
at org.gradle.api.internal.tasks.compile.JdkJavaCompiler.execute(JdkJavaCompiler.java:41)
at org.gradle.api.internal.tasks.compile.NormalizingJavaCompiler.delegateAndHandleErrors(NormalizingJavaCompiler.java:98)
at org.gradle.api.internal.tasks.compile.NormalizingJavaCompiler.execute(NormalizingJavaCompiler.java:52)
at org.gradle.api.internal.tasks.compile.NormalizingJavaCompiler.execute(NormalizingJavaCompiler.java:38)
at org.gradle.api.internal.tasks.compile.AnnotationProcessorDiscoveringCompiler.execute(AnnotationProcessorDiscoveringCompiler.java:52)
at org.gradle.api.internal.tasks.compile.AnnotationProcessorDiscoveringCompiler.execute(AnnotationProcessorDiscoveringCompiler.java:38)
at org.gradle.api.internal.tasks.compile.ModuleApplicationNameWritingCompiler.execute(ModuleApplicationNameWritingCompiler.java:46)
at org.gradle.api.internal.tasks.compile.ModuleApplicationNameWritingCompiler.execute(ModuleApplicationNameWritingCompiler.java:36)
at org.gradle.jvm.toolchain.internal.DefaultToolchainJavaCompiler.execute(DefaultToolchainJavaCompiler.java:57)
at org.gradle.api.tasks.compile.JavaCompile.lambda$createToolchainCompiler$3(JavaCompile.java:202)
at org.gradle.api.internal.tasks.compile.CleaningJavaCompiler.execute(CleaningJavaCompiler.java:53)
at org.gradle.api.internal.tasks.compile.incremental.IncrementalCompilerFactory.lambda$createRebuildAllCompiler$0(IncrementalCompilerFactory.java:52)
at org.gradle.api.internal.tasks.compile.incremental.SelectiveCompiler.execute(SelectiveCompiler.java:70)
at org.gradle.api.internal.tasks.compile.incremental.SelectiveCompiler.execute(SelectiveCompiler.java:44)
at org.gradle.api.internal.tasks.compile.incremental.IncrementalResultStoringCompiler.execute(IncrementalResultStoringCompiler.java:66)
at org.gradle.api.internal.tasks.compile.incremental.IncrementalResultStoringCompiler.execute(IncrementalResultStoringCompiler.java:52)
at org.gradle.api.internal.tasks.compile.CompileJavaBuildOperationReportingCompiler$1.call(CompileJavaBuildOperationReportingCompiler.java:64)
at org.gradle.api.internal.tasks.compile.CompileJavaBuildOperationReportingCompiler$1.call(CompileJavaBuildOperationReportingCompiler.java:48)
at org.gradle.internal.operations.DefaultBuildOperationRunner$CallableBuildOperationWorker.execute(DefaultBuildOperationRunner.java:200)
at org.gradle.internal.operations.DefaultBuildOperationRunner$CallableBuildOperationWorker.execute(DefaultBuildOperationRunner.java:195)
at org.gradle.internal.operations.DefaultBuildOperationRunner$2.execute(DefaultBuildOperationRunner.java:66)
at org.gradle.internal.operations.DefaultBuildOperationRunner$2.execute(DefaultBuildOperationRunner.java:59)
at org.gradle.internal.operations.DefaultBuildOperationRunner.execute(DefaultBuildOperationRunner.java:157)
at org.gradle.internal.operations.DefaultBuildOperationRunner.execute(DefaultBuildOperationRunner.java:59)
at org.gradle.internal.operations.DefaultBuildOperationRunner.call(DefaultBuildOperationRunner.java:53)
at org.gradle.internal.operations.DefaultBuildOperationExecutor.call(DefaultBuildOperationExecutor.java:73)
at org.gradle.api.internal.tasks.compile.CompileJavaBuildOperationReportingCompiler.execute(CompileJavaBuildOperationReportingCompiler.java:48)
at org.gradle.api.tasks.compile.JavaCompile.performCompilation(JavaCompile.java:220)
at org.gradle.api.tasks.compile.JavaCompile.performIncrementalCompilation(JavaCompile.java:161)
at org.gradle.api.tasks.compile.JavaCompile.compile(JavaCompile.java:146)
at org.gradle.internal.reflect.JavaMethod.invoke(JavaMethod.j
|
Linux (JDK 11, Avatica main)
Execution failed for task ':core:compileJava'.
> Compilation failed; see the compiler error output for details.
|
Linux (JDK 11, Avatica main):
core/src/main/java/org/apache/calcite/rel/stream/StreamRules.java#L343
[Task :core:compileJava] cannot find symbol
ImmutableDeltaTableScanToEmptyRuleConfig DEFAULT =
^
symbol: class ImmutableDeltaTableScanToEmptyRuleConfig
|
Linux (JDK 11, Avatica main):
core/src/main/java/org/apache/calcite/rel/rules/JoinDeriveIsNotNullFilterRule.java#L107
[Task :core:compileJava] package ImmutableJoinDeriveIsNotNullFilterRule does not exist
ImmutableJoinDeriveIsNotNullFilterRule.Config DEFAULT =
^
|
Linux (JDK 11, Avatica main):
core/src/main/java/org/apache/calcite/sql/fun/SqlLibraryOperators.java#L138
[Task :core:compileJava] LibraryOperator is not a repeatable annotation type
@LibraryOperator(libraries = {SPARK})
^
|
Linux (JDK 11, Avatica main):
core/src/main/java/org/apache/calcite/sql/validate/SqlValidator.java#L836
[Task :core:compileJava] package ImmutableSqlValidator does not exist
SqlValidator.Config DEFAULT = ImmutableSqlValidator.Config.builder()
^
|
Linux (JDK 11, Avatica main):
core/src/main/java/org/apache/calcite/sql/parser/SqlParser.java#L268
[Task :core:compileJava] package ImmutableSqlParser does not exist
Config DEFAULT = ImmutableSqlParser.Config.of();
^
|
Linux (JDK 11, Avatica main):
core/src/main/java/org/apache/calcite/sql2rel/SqlToRelConverter.java#L257
[Task :core:compileJava] package ImmutableSqlToRelConverter does not exist
ImmutableSqlToRelConverter.Config.builder()
^
|
Linux (JDK 11, Avatica main):
core/src/main/java/org/apache/calcite/rel/rules/AggregateRemoveRule.java#L169
[Task :core:compileJava] package ImmutableAggregateRemoveRule does not exist
Config DEFAULT = ImmutableAggregateRemoveRule.Config.of()
^
|
Linux (JDK 11, Avatica main):
core/src/main/java/org/apache/calcite/tools/RelBuilder.java#L5050
[Task :core:compileJava] package ImmutableRelBuilder does not exist
Config DEFAULT = ImmutableRelBuilder.Config.of();
^
|
macOS (JDK 21):
task ':core:compileJava'#L1
Execution failed for task ':core:compileJava':
org.gradle.api.internal.tasks.compile.CompilationFailedException: Compilation failed; see the compiler error output for details.
at org.gradle.api.internal.tasks.compile.JdkJavaCompiler.execute(JdkJavaCompiler.java:61)
at org.gradle.api.internal.tasks.compile.JdkJavaCompiler.execute(JdkJavaCompiler.java:41)
at org.gradle.api.internal.tasks.compile.NormalizingJavaCompiler.delegateAndHandleErrors(NormalizingJavaCompiler.java:98)
at org.gradle.api.internal.tasks.compile.NormalizingJavaCompiler.execute(NormalizingJavaCompiler.java:52)
at org.gradle.api.internal.tasks.compile.NormalizingJavaCompiler.execute(NormalizingJavaCompiler.java:38)
at org.gradle.api.internal.tasks.compile.AnnotationProcessorDiscoveringCompiler.execute(AnnotationProcessorDiscoveringCompiler.java:52)
at org.gradle.api.internal.tasks.compile.AnnotationProcessorDiscoveringCompiler.execute(AnnotationProcessorDiscoveringCompiler.java:38)
at org.gradle.api.internal.tasks.compile.ModuleApplicationNameWritingCompiler.execute(ModuleApplicationNameWritingCompiler.java:46)
at org.gradle.api.internal.tasks.compile.ModuleApplicationNameWritingCompiler.execute(ModuleApplicationNameWritingCompiler.java:36)
at org.gradle.jvm.toolchain.internal.DefaultToolchainJavaCompiler.execute(DefaultToolchainJavaCompiler.java:57)
at org.gradle.api.tasks.compile.JavaCompile.lambda$createToolchainCompiler$3(JavaCompile.java:202)
at org.gradle.api.internal.tasks.compile.CleaningJavaCompiler.execute(CleaningJavaCompiler.java:53)
at org.gradle.api.internal.tasks.compile.incremental.IncrementalCompilerFactory.lambda$createRebuildAllCompiler$0(IncrementalCompilerFactory.java:52)
at org.gradle.api.internal.tasks.compile.incremental.SelectiveCompiler.execute(SelectiveCompiler.java:70)
at org.gradle.api.internal.tasks.compile.incremental.SelectiveCompiler.execute(SelectiveCompiler.java:44)
at org.gradle.api.internal.tasks.compile.incremental.IncrementalResultStoringCompiler.execute(IncrementalResultStoringCompiler.java:66)
at org.gradle.api.internal.tasks.compile.incremental.IncrementalResultStoringCompiler.execute(IncrementalResultStoringCompiler.java:52)
at org.gradle.api.internal.tasks.compile.CompileJavaBuildOperationReportingCompiler$1.call(CompileJavaBuildOperationReportingCompiler.java:64)
at org.gradle.api.internal.tasks.compile.CompileJavaBuildOperationReportingCompiler$1.call(CompileJavaBuildOperationReportingCompiler.java:48)
at org.gradle.internal.operations.DefaultBuildOperationRunner$CallableBuildOperationWorker.execute(DefaultBuildOperationRunner.java:200)
at org.gradle.internal.operations.DefaultBuildOperationRunner$CallableBuildOperationWorker.execute(DefaultBuildOperationRunner.java:195)
at org.gradle.internal.operations.DefaultBuildOperationRunner$2.execute(DefaultBuildOperationRunner.java:66)
at org.gradle.internal.operations.DefaultBuildOperationRunner$2.execute(DefaultBuildOperationRunner.java:59)
at org.gradle.internal.operations.DefaultBuildOperationRunner.execute(DefaultBuildOperationRunner.java:157)
at org.gradle.internal.operations.DefaultBuildOperationRunner.execute(DefaultBuildOperationRunner.java:59)
at org.gradle.internal.operations.DefaultBuildOperationRunner.call(DefaultBuildOperationRunner.java:53)
at org.gradle.internal.operations.DefaultBuildOperationExecutor.call(DefaultBuildOperationExecutor.java:73)
at org.gradle.api.internal.tasks.compile.CompileJavaBuildOperationReportingCompiler.execute(CompileJavaBuildOperationReportingCompiler.java:48)
at org.gradle.api.tasks.compile.JavaCompile.performCompilation(JavaCompile.java:220)
at org.gradle.api.tasks.compile.JavaCompile.performIncrementalCompilation(JavaCompile.java:161)
at org.gradle.api.tasks.compile.JavaCompile.compile(JavaCompile.java:146)
at org.gradle.internal.reflect.JavaMethod.invoke(JavaMethod.j
|
macOS (JDK 21)
Execution failed for task ':core:compileJava'.
> Compilation failed; see the compiler error output for details.
|
macOS (JDK 21):
core/src/main/java/org/apache/calcite/rel/stream/StreamRules.java#L343
[Task :core:compileJava] cannot find symbol
ImmutableDeltaTableScanToEmptyRuleConfig DEFAULT =
^
symbol: class ImmutableDeltaTableScanToEmptyRuleConfig
|
macOS (JDK 21):
core/src/main/java/org/apache/calcite/rel/rules/JoinDeriveIsNotNullFilterRule.java#L107
[Task :core:compileJava] package ImmutableJoinDeriveIsNotNullFilterRule does not exist
ImmutableJoinDeriveIsNotNullFilterRule.Config DEFAULT =
^
|
macOS (JDK 21):
core/src/main/java/org/apache/calcite/sql/fun/SqlLibraryOperators.java#L138
[Task :core:compileJava] LibraryOperator is not a repeatable annotation interface
@LibraryOperator(libraries = {SPARK})
^
|
macOS (JDK 21):
core/src/main/java/org/apache/calcite/sql/validate/SqlValidator.java#L836
[Task :core:compileJava] package ImmutableSqlValidator does not exist
SqlValidator.Config DEFAULT = ImmutableSqlValidator.Config.builder()
^
|
macOS (JDK 21):
core/src/main/java/org/apache/calcite/sql/parser/SqlParser.java#L268
[Task :core:compileJava] package ImmutableSqlParser does not exist
Config DEFAULT = ImmutableSqlParser.Config.of();
^
|
macOS (JDK 21):
core/src/main/java/org/apache/calcite/rel/convert/ConverterRule.java#L114
[Task :core:compileJava] package ImmutableConverterRule does not exist
this(ImmutableConverterRule.Config.builder()
^
|
macOS (JDK 21):
core/src/main/java/org/apache/calcite/rel/convert/ConverterRule.java#L187
[Task :core:compileJava] package ImmutableConverterRule does not exist
Config INSTANCE = ImmutableConverterRule.Config.builder()
^
|
macOS (JDK 21):
core/src/main/java/org/apache/calcite/rel/rules/AggregateRemoveRule.java#L169
[Task :core:compileJava] package ImmutableAggregateRemoveRule does not exist
Config DEFAULT = ImmutableAggregateRemoveRule.Config.of()
^
|
Linux (JDK 17)
The following actions uses node12 which is deprecated and will be forced to run on node16: actions/setup-java@v2. For more info: https://github.blog/changelog/2023-06-13-github-actions-all-actions-will-run-on-node16-instead-of-node12-by-default/
|
Linux (JDK 17)
The following actions use a deprecated Node.js version and will be forced to run on node20: actions/checkout@v3, actions/setup-java@v2, burrunan/gradle-cache-action@v1. For more info: https://github.blog/changelog/2024-03-07-github-actions-all-actions-will-run-on-node20-instead-of-node16-by-default/
|
Linux (JDK 8, oldest Guava, America/New_York Timezone)
The following actions uses node12 which is deprecated and will be forced to run on node16: actions/setup-java@v2. For more info: https://github.blog/changelog/2023-06-13-github-actions-all-actions-will-run-on-node16-instead-of-node12-by-default/
|
Linux (JDK 8, oldest Guava, America/New_York Timezone)
The following actions use a deprecated Node.js version and will be forced to run on node20: actions/checkout@v3, actions/setup-java@v2, burrunan/gradle-cache-action@v1. For more info: https://github.blog/changelog/2024-03-07-github-actions-all-actions-will-run-on-node20-instead-of-node16-by-default/
|
ErrorProne (JDK 11, latest Guava)
The following actions uses node12 which is deprecated and will be forced to run on node16: actions/setup-java@v2. For more info: https://github.blog/changelog/2023-06-13-github-actions-all-actions-will-run-on-node16-instead-of-node12-by-default/
|
ErrorProne (JDK 11, latest Guava)
The following actions use a deprecated Node.js version and will be forced to run on node20: actions/checkout@v3, actions/setup-java@v2, burrunan/gradle-cache-action@v1. For more info: https://github.blog/changelog/2024-03-07-github-actions-all-actions-will-run-on-node20-instead-of-node16-by-default/
|
Linux (JDK 8, latest Guava, America/New_York Timezone)
The following actions uses node12 which is deprecated and will be forced to run on node16: actions/setup-java@v2. For more info: https://github.blog/changelog/2023-06-13-github-actions-all-actions-will-run-on-node16-instead-of-node12-by-default/
|
Linux (JDK 8, latest Guava, America/New_York Timezone)
The following actions use a deprecated Node.js version and will be forced to run on node20: actions/checkout@v3, actions/setup-java@v2, burrunan/gradle-cache-action@v1. For more info: https://github.blog/changelog/2024-03-07-github-actions-all-actions-will-run-on-node20-instead-of-node16-by-default/
|
Linux (JDK 11, Pacific/Chatham Timezone)
The following actions uses node12 which is deprecated and will be forced to run on node16: actions/setup-java@v2. For more info: https://github.blog/changelog/2023-06-13-github-actions-all-actions-will-run-on-node16-instead-of-node12-by-default/
|
Linux (JDK 11, Pacific/Chatham Timezone)
The following actions use a deprecated Node.js version and will be forced to run on node20: actions/checkout@v3, actions/setup-java@v2, burrunan/gradle-cache-action@v1. For more info: https://github.blog/changelog/2024-03-07-github-actions-all-actions-will-run-on-node20-instead-of-node16-by-default/
|
Linux (JDK 23)
The following actions uses node12 which is deprecated and will be forced to run on node16: actions/setup-java@v2. For more info: https://github.blog/changelog/2023-06-13-github-actions-all-actions-will-run-on-node16-instead-of-node12-by-default/
|
Linux (JDK 23)
The following actions use a deprecated Node.js version and will be forced to run on node20: actions/checkout@v3, actions/setup-java@v2, burrunan/gradle-cache-action@v1. For more info: https://github.blog/changelog/2024-03-07-github-actions-all-actions-will-run-on-node20-instead-of-node16-by-default/
|
Linux (JDK 21)
The following actions uses node12 which is deprecated and will be forced to run on node16: actions/setup-java@v2. For more info: https://github.blog/changelog/2023-06-13-github-actions-all-actions-will-run-on-node16-instead-of-node12-by-default/
|
Linux (JDK 21)
The following actions use a deprecated Node.js version and will be forced to run on node20: actions/checkout@v3, actions/setup-java@v2, burrunan/gradle-cache-action@v1. For more info: https://github.blog/changelog/2024-03-07-github-actions-all-actions-will-run-on-node20-instead-of-node16-by-default/
|
Windows (JDK 17)
The following actions uses node12 which is deprecated and will be forced to run on node16: actions/setup-java@v2. For more info: https://github.blog/changelog/2023-06-13-github-actions-all-actions-will-run-on-node16-instead-of-node12-by-default/
|
Windows (JDK 17)
The following actions use a deprecated Node.js version and will be forced to run on node20: actions/checkout@v3, actions/setup-java@v2, burrunan/gradle-cache-action@v1. For more info: https://github.blog/changelog/2024-03-07-github-actions-all-actions-will-run-on-node20-instead-of-node16-by-default/
|
Windows (JDK 21)
The following actions uses node12 which is deprecated and will be forced to run on node16: actions/setup-java@v2. For more info: https://github.blog/changelog/2023-06-13-github-actions-all-actions-will-run-on-node16-instead-of-node12-by-default/
|
Windows (JDK 21)
The following actions use a deprecated Node.js version and will be forced to run on node20: actions/checkout@v3, actions/setup-java@v2, burrunan/gradle-cache-action@v1. For more info: https://github.blog/changelog/2024-03-07-github-actions-all-actions-will-run-on-node20-instead-of-node16-by-default/
|
CheckerFramework (JDK 11)
The following actions uses node12 which is deprecated and will be forced to run on node16: actions/setup-java@v2. For more info: https://github.blog/changelog/2023-06-13-github-actions-all-actions-will-run-on-node16-instead-of-node12-by-default/
|
CheckerFramework (JDK 11)
The following actions use a deprecated Node.js version and will be forced to run on node20: actions/checkout@v3, actions/setup-java@v2, burrunan/gradle-cache-action@v1. For more info: https://github.blog/changelog/2024-03-07-github-actions-all-actions-will-run-on-node20-instead-of-node16-by-default/
|
CheckerFramework (JDK 11, oldest Guava)
The following actions uses node12 which is deprecated and will be forced to run on node16: actions/setup-java@v2. For more info: https://github.blog/changelog/2023-06-13-github-actions-all-actions-will-run-on-node16-instead-of-node12-by-default/
|
CheckerFramework (JDK 11, oldest Guava)
The following actions use a deprecated Node.js version and will be forced to run on node20: actions/checkout@v3, actions/setup-java@v2, burrunan/gradle-cache-action@v1. For more info: https://github.blog/changelog/2024-03-07-github-actions-all-actions-will-run-on-node20-instead-of-node16-by-default/
|
Druid Tests
The following actions uses node12 which is deprecated and will be forced to run on node16: actions/setup-java@v2. For more info: https://github.blog/changelog/2023-06-13-github-actions-all-actions-will-run-on-node16-instead-of-node12-by-default/
|
Druid Tests
The following actions use a deprecated Node.js version and will be forced to run on node20: actions/setup-java@v2, actions/checkout@v3, burrunan/gradle-cache-action@v1. For more info: https://github.blog/changelog/2024-03-07-github-actions-all-actions-will-run-on-node20-instead-of-node16-by-default/
|
Windows (JDK 8)
The following actions uses node12 which is deprecated and will be forced to run on node16: actions/setup-java@v2. For more info: https://github.blog/changelog/2023-06-13-github-actions-all-actions-will-run-on-node16-instead-of-node12-by-default/
|
Windows (JDK 8)
The following actions use a deprecated Node.js version and will be forced to run on node20: actions/checkout@v3, actions/setup-java@v2, burrunan/gradle-cache-action@v1. For more info: https://github.blog/changelog/2024-03-07-github-actions-all-actions-will-run-on-node20-instead-of-node16-by-default/
|
Linux (JDK 11, Avatica main)
The following actions uses node12 which is deprecated and will be forced to run on node16: actions/setup-java@v2. For more info: https://github.blog/changelog/2023-06-13-github-actions-all-actions-will-run-on-node16-instead-of-node12-by-default/
|
Linux (JDK 11, Avatica main)
The following actions use a deprecated Node.js version and will be forced to run on node20: actions/setup-java@v2, burrunan/gradle-cache-action@v1, actions/checkout@v3. For more info: https://github.blog/changelog/2024-03-07-github-actions-all-actions-will-run-on-node20-instead-of-node16-by-default/
|
macOS (JDK 21)
The following actions uses node12 which is deprecated and will be forced to run on node16: actions/setup-java@v2. For more info: https://github.blog/changelog/2023-06-13-github-actions-all-actions-will-run-on-node16-instead-of-node12-by-default/
|
macOS (JDK 21)
The following actions use a deprecated Node.js version and will be forced to run on node20: actions/checkout@v3, actions/setup-java@v2, burrunan/gradle-cache-action@v1. For more info: https://github.blog/changelog/2024-03-07-github-actions-all-actions-will-run-on-node20-instead-of-node16-by-default/
|